Build: #3 failed Changes by Eric Milles

Build result summary

Details

Completed
Duration
106 minutes
Labels
None
Agent
bamboo-21.af.pivotal.io
Revision
aa050514e34591f950f1ac177bff87db15354ee0 aa050514e34591f950f1ac177bff87db15354ee0
Total tests
5848
Fixed in
#11 (Changes by Eric Milles)

Tests

Responsible

Code commits

Author Commit Message Commit date
Eric Milles Eric Milles aa050514e34591f950f1ac177bff87db15354ee0 aa050514e34591f950f1ac177bff87db15354ee0 Update the Groovy plug-in to 3.0.0-beta-2
#925

Configuration changes

Plan configuration has changed since the last successful build. See the plan audit log for more details.

Tests

New test failures 2
Status Test View job Duration
Collapse Failed BasicGroovyBuildTests testTaskMarkerInMultiLineCommentButOnOneLine History
Default Job < 1 sec
java.lang.AssertionError: missing expected problem: Problem : todonothing [ resource : </Project/src/p/A.groovy> range : <16,29> category : <-1> severity : <2>]
	at org.eclipse.jdt.core.groovy.tests.builder.BasicGroovyBuildTests.testTaskMarkerInMultiLineCommentButOnOneLine(BasicGroovyBuildTests.java:2586)
Collapse Failed DGMInferencingTests testDGM7 History
Default Job < 1 sec
java.lang.AssertionError: Expected type not found.
Expected: java.lang.String
Found: java.lang.Object
Declaring type: Search
ASTNode: org.codehaus.groovy.ast.expr.VariableExpression@f0080[variable: key]
Confidence: INFERRED

java.lang.AssertionError: 
(9 more lines...)