Build: #343 failed Changes by Eric Milles

Build result summary

Details

Completed
Duration
98 minutes
Labels
None
Agent
bamboo-11.af.pivotal.io
Revision
a972b7dd6675da40d28e7121c774cf29c8f12d97 a972b7dd6675da40d28e7121c774cf29c8f12d97
Total tests
6462
Fixed in
#344 (Changes by Eric Milles)

Tests

Responsible

Code commits

Author Commit Message Commit date
Eric Milles Eric Milles a972b7dd6675da40d28e7121c774cf29c8f12d97 a972b7dd6675da40d28e7121c774cf29c8f12d97 minor fix-ups

Tests

New test failures 3
Status Test View job Duration
Collapse Failed BinarySearchTests testFieldDecl1 History
Default Job 1 sec
java.lang.AssertionError: Expecting 2 matches, but found 0

java.lang.AssertionError: 
Expecting 2 matches, but found 0

	at org.eclipse.jdt.core.groovy.tests.search.BinarySearchTests.assertMatches(BinarySearchTests.java:139)
	at org.eclipse.jdt.core.groovy.tests.search.BinarySearchTests.testFieldDecl1(BinarySearchTests.java:181)
Collapse Failed ClosureInferencingTests testClosure11 History
Default Job < 1 sec
java.lang.AssertionError: Expected type not found.
Expected: Foo
Found: java.lang.Class<Foo>
Declaring type: groovy.lang.Closure<V extends java.lang.Object>
ASTNode: org.codehaus.groovy.ast.expr.VariableExpression@10784d[variable: delegate]
Confidence: INFERRED

java.lang.AssertionError: 
(8 more lines...)
Collapse Failed DGMInferencingTests testDGM2a History
Default Job < 1 sec
java.lang.AssertionError: Expected type not found.
Expected: java.lang.String
Found: java.lang.Number
Declaring type: Z
ASTNode: org.codehaus.groovy.ast.expr.VariableExpression@11bb76[variable: value type: java.lang.Number -> java.lang.Number]
Confidence: EXACT

java.lang.AssertionError: 
(9 more lines...)