Build: #349 failed Changes by Eric Milles

Build result summary

Details

Completed
Duration
99 minutes
Labels
None
Agent
bamboo-17.af.pivotal.io
Revision
c41eaab1acd624ed866a7f8ee2bb32a126b46c89 c41eaab1acd624ed866a7f8ee2bb32a126b46c89
Total tests
6482
Fixed in
#353 (Changes by Eric Milles)

Tests

Responsible

Code commits

Author Commit Message Commit date
Eric Milles Eric Milles c41eaab1acd624ed866a7f8ee2bb32a126b46c89 c41eaab1acd624ed866a7f8ee2bb32a126b46c89 Fix for #1120: wrap expr in stmt to prevent extra closure scope

Tests

New test failures 4
Status Test View job Duration
Collapse Failed BasicGroovyBuildTests testAnnotationCollectorMultiProject History
Default Job < 1 sec
org.junit.ComparisonFailure: unexpected recompiled units. lenExpected=3 lenActual=4 expected:<...lper,com.demo.Widget[]}> but was:<...lper,com.demo.Widget[,com.demo.Widget]}>
	at org.eclipse.jdt.core.groovy.tests.builder.BasicGroovyBuildTests.testAnnotationCollectorMultiProject(BasicGroovyBuildTests.java:1757)
Collapse Failed BasicGroovyBuildTests testProjectCompilerConfigScript2 History
Default Job < 1 sec
org.junit.ComparisonFailure: unexpected recompiled units. lenExpected=1 lenActual=2 expected:<{foo.Bar[]}> but was:<{foo.Bar[,foo.Bar]}>
	at org.eclipse.jdt.core.groovy.tests.builder.BasicGroovyBuildTests.testProjectCompilerConfigScript2(BasicGroovyBuildTests.java:366)
Collapse Failed ClosureInferencingTests testClosure27 History
Default Job < 1 sec
java.lang.AssertionError: Expected type not found.
Expected: java.util.Date
Found: Search
Declaring type: groovy.lang.Closure<V extends java.lang.Object>
ASTNode: org.codehaus.groovy.ast.expr.VariableExpression@efcc3[variable: delegate]
Confidence: INFERRED

java.lang.AssertionError: 
(8 more lines...)
Collapse Failed DGMInferencingTests testDGM25 History
Default Job < 1 sec
java.lang.AssertionError: Expected type not found.
Expected: java.math.BigDecimal
Found: java.lang.Object
Declaring type: Search
ASTNode: org.codehaus.groovy.ast.Parameter@ee271[name:seed type: java.lang.Object, hasDefaultValue: false]
Confidence: EXACT

java.lang.AssertionError: 
(9 more lines...)