Build: #364 failed Changes by Eric Milles

Build result summary

Details

Completed
Duration
99 minutes
Labels
None
Agent
bamboo-19.af.pivotal.io
Revision
e57f3a48b9828bc1d77baa5e6d12917c6bccdcdf e57f3a48b9828bc1d77baa5e6d12917c6bccdcdf
Total tests
6550
Failing since
#359 (Changes by Eric Milles)
Fixed in
#366 (Changes by Eric Milles)

Responsible

Code commits

Author Commit Message Commit date
Eric Milles Eric Milles e57f3a48b9828bc1d77baa5e6d12917c6bccdcdf e57f3a48b9828bc1d77baa5e6d12917c6bccdcdf bump guava version

Tests

New test failures 2
Status Test View job Duration
Collapse Failed GroovyContentTypeTests testJavaThenGroovyProject History
Default Job < 1 sec
java.lang.AssertionError: L/Project/bin/p1/HelloJava.class should exist
	at org.eclipse.jdt.core.groovy.tests.model.GroovyContentTypeTests.checkJavaProject(GroovyContentTypeTests.java:152)
	at org.eclipse.jdt.core.groovy.tests.model.GroovyContentTypeTests.testJavaThenGroovyProject(GroovyContentTypeTests.java:98)
Collapse Failed DGMInferencingTests testDGM42 History
Default Job < 1 sec
java.lang.AssertionError: Expected type not found.
Expected: java.lang.String
Found: java.lang.Object
Declaring type: groovy.lang.Closure<V extends java.lang.Object>
ASTNode: org.codehaus.groovy.ast.expr.VariableExpression@fc7a9[variable: it]
Confidence: INFERRED

java.lang.AssertionError: 
(9 more lines...)
Fixed tests 2
Status Test Failing since View job Duration
Successful BuildAccessRulesTests testAccessForField History
Failing since build #363 (Changes by Eric Milles) Default Job < 1 sec
Successful InferencingTests testNothingIsUnknownWithCategories History
Failing since build #363 (Changes by Eric Milles) Default Job < 1 sec