Build: #446 failed Changes by Eric Milles

Build result summary

Details

Completed
Duration
104 minutes
Labels
None
Revision
2f7788a0ad6eac1ddd081aa69fa85eb45985c47b 2f7788a0ad6eac1ddd081aa69fa85eb45985c47b
Total tests
5789
Fixed in
#447 (Code changes detected)

Tests

Responsible

Code commits

Author Commit Message Commit date
Eric Milles Eric Milles 2f7788a0ad6eac1ddd081aa69fa85eb45985c47b 2f7788a0ad6eac1ddd081aa69fa85eb45985c47b minor fix-ups

Tests

New test failures 13
Status Test View job Duration
Collapse Failed MoveCURefactoringTests testNonPrimaryMove History
Default Job 1 sec
org.junit.ComparisonFailure: Refactoring produced unexpected results: expected:<package p2
import [NEW].Groovy
public class...> but was:<package p2
import [p1].Groovy
public class...>
org.junit.ComparisonFailure: 
Refactoring produced unexpected results: expected:<package p2
import [NEW].Groovy
(5 more lines...)
Collapse Failed MoveCURefactoringTests testSimpleMove4 History
Default Job 1 sec
org.junit.ComparisonFailure: Refactoring produced unexpected results: expected:<package p2
import [NEW].Groovy
public class...> but was:<package p2
import [p1].Groovy
public class...>
org.junit.ComparisonFailure: 
Refactoring produced unexpected results: expected:<package p2
import [NEW].Groovy
(5 more lines...)
Collapse Failed MoveCURefactoringTests testSimpleMove3 History
Default Job < 1 sec
org.junit.ComparisonFailure: Refactoring produced unexpected results: expected:<package p;
[
import NEW.Java

]public class Groovy ...> but was:<package p;
[]public class Groovy ...>
org.junit.ComparisonFailure: 
Refactoring produced unexpected results: expected:<package p;
(7 more lines...)
Collapse Failed MoveCURefactoringTests testNonPrimaryQualifiedMove History
Default Job 1 sec
org.junit.ComparisonFailure: Refactoring produced unexpected results: expected:<...ass Groovy2 extends [NEW].Groovy {}> but was:<...ass Groovy2 extends [p1].Groovy {}>
	at org.codehaus.groovy.eclipse.refactoring.test.rename.MoveCURefactoringTests.performRefactoringAndUndo(MoveCURefactoringTests.groovy:67)
	at org.codehaus.groovy.eclipse.refactoring.test.rename.MoveCURefactoringTests.testNonPrimaryQualifiedMove(MoveCURefactoringTests.groovy:235)
Collapse Failed MoveCURefactoringTests testMoveBack History
Default Job 1 sec
org.junit.ComparisonFailure: Refactoring produced unexpected results: expected:<package p2
[]
public class Groovy...> but was:<package p2
[import p1.Groovy
]
public class Groovy...>
org.junit.ComparisonFailure: 
Refactoring produced unexpected results: expected:<package p2
(7 more lines...)
Collapse Failed MoveCURefactoringTests testQualifiedMove3 History
Default Job 1 sec
org.junit.ComparisonFailure: Refactoring produced unexpected results: expected:<... g1

import static j[2.Java.*
import j2.Java

class Groovy {
  def m1() {
    Java j = new j2].Java()
(33 more lines...)
Collapse Failed MoveCURefactoringTests testQualifiedMove2 History
Default Job 1 sec
org.junit.ComparisonFailure: Refactoring produced unexpected results: expected:<...ass Groovy2 extends [NEW].Groovy {}> but was:<...ass Groovy2 extends [p1].Groovy {}>
	at org.codehaus.groovy.eclipse.refactoring.test.rename.MoveCURefactoringTests.performRefactoringAndUndo(MoveCURefactoringTests.groovy:67)
	at org.codehaus.groovy.eclipse.refactoring.test.rename.MoveCURefactoringTests.testQualifiedMove2(MoveCURefactoringTests.groovy:157)
Collapse Failed MoveCURefactoringTests testQualifiedMove1 History
Default Job 1 sec
org.junit.ComparisonFailure: Refactoring produced unexpected results: expected:<...lass Groovy extends [NEW].Java {}> but was:<...lass Groovy extends [p].Java {}>
	at org.codehaus.groovy.eclipse.refactoring.test.rename.MoveCURefactoringTests.performRefactoringAndUndo(MoveCURefactoringTests.groovy:67)
	at org.codehaus.groovy.eclipse.refactoring.test.rename.MoveCURefactoringTests.testQualifiedMove1(MoveCURefactoringTests.groovy:144)
Collapse Failed BinarySearchTests testFieldRefInInitializer History
Default Job < 1 sec
java.lang.AssertionError: Expecting 1 matches, but found 0

java.lang.AssertionError: 
Expecting 1 matches, but found 0

	at org.eclipse.jdt.core.groovy.tests.search.BinarySearchTests.assertMatches(BinarySearchTests.java:122)
	at org.eclipse.jdt.core.groovy.tests.search.BinarySearchTests.testFieldRefInInitializer(BinarySearchTests.java:185)
Collapse Failed BinarySearchTests testMethodDecl History
Default Job < 1 sec
java.lang.AssertionError: Expecting 4 matches, but found 0

java.lang.AssertionError: 
Expecting 4 matches, but found 0

	at org.eclipse.jdt.core.groovy.tests.search.BinarySearchTests.assertMatches(BinarySearchTests.java:122)
	at org.eclipse.jdt.core.groovy.tests.search.BinarySearchTests.testMethodDecl(BinarySearchTests.java:177)
Collapse Failed ConstructorReferenceSearchTests testConstructorReferences2 History
Default Job < 1 sec
java.lang.AssertionError: Incorrect number of matches; expected:<1> but was:<0>
	at org.eclipse.jdt.core.groovy.tests.search.ConstructorReferenceSearchTests.testConstructorReferences2(ConstructorReferenceSearchTests.java:94)
Collapse Failed ConstructorReferenceSearchTests testConstructorReferences12 History
Default Job < 1 sec
java.lang.AssertionError: expected:<1> but was:<0>
	at org.eclipse.jdt.core.groovy.tests.search.ConstructorReferenceSearchTests.testConstructorReferences12(ConstructorReferenceSearchTests.java:333)
Collapse Failed StaticInferencingTests testStaticImport3 History
Default Job < 1 sec
java.lang.AssertionError: Expected token 'FOO' at offset 26 to be recognized. Actual: UNKNOWN
	at org.eclipse.jdt.core.groovy.tests.search.StaticInferencingTests.assertKnown(StaticInferencingTests.java:35)
	at org.eclipse.jdt.core.groovy.tests.search.StaticInferencingTests.testStaticImport3(StaticInferencingTests.java:423)