Build: #461 failed Changes by Eric Milles

Build result summary

Details

Completed
Duration
74 minutes
Labels
None
Revision
47f44410d9e1124a477774023695e6e91b4fa3a5 47f44410d9e1124a477774023695e6e91b4fa3a5
Total tests
5838
Failing since
#460 (Changes by Eric Milles)
Fixed in
#462 (Changes by Eric Milles)

Responsible

Code commits

Author Commit Message Commit date
Eric Milles Eric Milles 47f44410d9e1124a477774023695e6e91b4fa3a5 47f44410d9e1124a477774023695e6e91b4fa3a5 Fix for #1198: capture expression lambda's expression statement type
Eric Milles Eric Milles 8284581472fa42efed809e4aba3b5837a20b94ee 8284581472fa42efed809e4aba3b5837a20b94ee Fix for #1194: resolve generics via "? extends T" and "? super T"

Tests

New test failures 4
Status Test View job Duration
Collapse Failed ConstructorReferenceSearchTests testConstructorReferences14 History
Default Job < 1 sec
java.lang.AssertionError: expected:<1> but was:<0>
	at org.eclipse.jdt.core.groovy.tests.search.ConstructorReferenceSearchTests.testConstructorReferences14(ConstructorReferenceSearchTests.java:416)
Collapse Failed ConstructorReferenceSearchTests testConstructorReferences11 History
Default Job < 1 sec
java.lang.AssertionError: expected:<1> but was:<0>
	at org.eclipse.jdt.core.groovy.tests.search.ConstructorReferenceSearchTests.testConstructorReferences11(ConstructorReferenceSearchTests.java:273)
Collapse Failed InferencingTests testStaticMethod7 History
Default Job < 1 sec
java.lang.AssertionError: Expected type not found.
Expected: java.util.Collection
Found: java.lang.Object
Declaring type: Search
ASTNode: [email protected][object: [email protected][variable: this] method: [email protected][meth] arguments: [email protected][[email protected][]]]
Confidence: EXACT

java.lang.AssertionError: 
(8 more lines...)
Collapse Failed TypeReferenceSearchTests testInnerTypes2 History
Default Job < 1 sec
java.lang.AssertionError: Wrong number of matches found:
[Search match
  accuracy=ACCURATE
  rule=EXACT
  raw=false
  offset=25
  length=5
  element=import p.Other.First [in <import container> [in Second.groovy [in q [in src [in Project]]]]]
(54 more lines...)
Fixed tests 1
Status Test Failing since View job Duration
Successful BasicGroovyBuildTests testBuildJavaHelloWorld History
Failing since build #460 (Changes by Eric Milles) Default Job < 1 sec