Build: #464 failed Changes by Eric Milles

Build result summary

Details

Completed
Duration
73 minutes
Labels
None
Revision
6187e12acf4c91283cadac8a92b14bfa36a16a59 6187e12acf4c91283cadac8a92b14bfa36a16a59
Total tests
5855
Fixed in
#469 (Changes by Eric Milles)

Tests

Responsible

Code commits

Author Commit Message Commit date
Eric Milles Eric Milles 6187e12acf4c91283cadac8a92b14bfa36a16a59 6187e12acf4c91283cadac8a92b14bfa36a16a59 GROOVY-9825
Eric Milles Eric Milles 31c63d21edfd3825c9c6138f8526bc7981e696e6 31c63d21edfd3825c9c6138f8526bc7981e696e6 GROOVY-9821 pt.2

Tests

New test failures 4
Status Test View job Duration
Collapse Failed BasicGroovyBuildTests testTags4 History
Default Job < 1 sec
java.lang.AssertionError: Wrong size expected:<2> but was:<0>
	at org.eclipse.jdt.core.groovy.tests.builder.BasicGroovyBuildTests.testTags4(BasicGroovyBuildTests.java:3419)
Collapse Failed ConstructorReferenceSearchTests testConstructorReferences5 History
Default Job < 1 sec
java.lang.AssertionError: expected:<1> but was:<0>
	at org.eclipse.jdt.core.groovy.tests.search.ConstructorReferenceSearchTests.testConstructorReferences5(ConstructorReferenceSearchTests.java:160)
Collapse Failed InferencingTests testStaticMethod9 History
Default Job < 1 sec
java.lang.AssertionError: Expected type not found.
Expected: java.util.regex.Pattern
Found: java.lang.Object
Declaring type: Search
ASTNode: [email protected][object: [email protected][variable: this] method: [email protected][meth] arguments: [email protected][[email protected][java.util.regex.Pattern#compile arguments: [email protected][[email protected][abc]]]]]
Confidence: EXACT

java.lang.AssertionError: 
(8 more lines...)
Collapse Failed InferencingTests testStaticMethod8 History
Default Job < 1 sec
java.lang.AssertionError: Expected type not found.
Expected: java.util.regex.Pattern
Found: java.lang.Object
Declaring type: Search
ASTNode: [email protected][object: [email protected][variable: this] method: [email protected][meth] arguments: [email protected][[email protected]]]
Confidence: EXACT

java.lang.AssertionError: 
(8 more lines...)

Jira issues

IssueDescriptionStatus
Unknown Issue TypeGROOVY-9821Could not obtain issue details from Jira
Unknown Issue TypeGROOVY-9825Could not obtain issue details from Jira