Build: #468 failed Changes by Eric Milles

Build result summary

Details

Completed
Duration
73 minutes
Labels
None
Revision
e5dfebc0dfe33e5563c32f5fafc22c845c74aeec e5dfebc0dfe33e5563c32f5fafc22c845c74aeec
Total tests
5859
Failing since
#464 (Changes by Eric Milles)
Fixed in
#469 (Changes by Eric Milles)

Responsible

Code commits

Author Commit Message Commit date
Eric Milles Eric Milles e5dfebc0dfe33e5563c32f5fafc22c845c74aeec e5dfebc0dfe33e5563c32f5fafc22c845c74aeec Fix for #1199: use LHS type to further resolve method pointer/reference
Eric Milles Eric Milles ebae30fde469b1ccf88cafbbf734eff3bf7d8910 ebae30fde469b1ccf88cafbbf734eff3bf7d8910 Fix for #1194: use Closure to further resolve method pointer/reference

Tests

New test failures 2
Status Test View job Duration
Collapse Failed ConstructorReferenceSearchTests testConstructorReferences13 History
Default Job < 1 sec
java.lang.AssertionError: expected:<1> but was:<0>
	at org.eclipse.jdt.core.groovy.tests.search.ConstructorReferenceSearchTests.testConstructorReferences13(ConstructorReferenceSearchTests.java:390)
Collapse Failed InferencingTests testInterfaceMethodAsProperty1 History
Default Job < 1 sec
java.lang.AssertionError: Expected declaring type not found.
 Expect: foo.Bar
 Actual: foo.Baz
 ASTNode: [email protected][one]
java.lang.AssertionError: 
Expected declaring type not found.
	Expect: foo.Bar
	Actual: foo.Baz
(2 more lines...)
Existing test failures 1
Status Test Failing since View job Duration
java.lang.AssertionError: Expected token 'dump' at offset 22 to be recognized. Actual: UNKNOWN
	at org.eclipse.jdt.core.groovy.tests.search.StaticInferencingTests.assertKnown(StaticInferencingTests.java:35)
	at org.eclipse.jdt.core.groovy.tests.search.StaticInferencingTests.testStaticImport10(StaticInferencingTests.java:476)
Fixed tests 3
Status Test Failing since View job Duration
Successful BasicGroovyBuildTests testTags3 History
Failing since build #467 (Changes by Eric Milles) Default Job < 1 sec
Successful ConstructorReferenceSearchTests testConstructorReferences4 History
Failing since build #467 (Changes by Eric Milles) Default Job < 1 sec
Successful InferencingTests testSuperFieldReference5a History
Failing since build #467 (Changes by Eric Milles) Default Job < 1 sec