Build: #472 failed Code changes detected

Build result summary

Details

Completed
Duration
73 minutes
Labels
None
Revision
404c6b02b0ae549fa500f26b2a17618472ac82cd 404c6b02b0ae549fa500f26b2a17618472ac82cd
Total tests
5860
Fixed in
#473 (Changes by Eric Milles)

Tests

Responsible

No one has taken responsibility for this failure

Code commits

Author Commit Message Commit date
Eric Milles Eric Milles 404c6b02b0ae549fa500f26b2a17618472ac82cd m 404c6b02b0ae549fa500f26b2a17618472ac82cd re-sync with Groovy 3.0.7
Eric Milles Eric Milles 748ed4f58c7b41f335181fe2a0d663723133d4ad m 748ed4f58c7b41f335181fe2a0d663723133d4ad Fix for #1209: use correct method name and token type

Tests

New test failures 4
Status Test View job Duration
Collapse Failed ClosureInferencingTests testWithAndClosure3 History
Default Job < 1 sec
java.lang.AssertionError: Expected type not found.
Expected: java.lang.Void
Found: java.lang.String
Declaring type: null
ASTNode: [email protected][variable: foo]
Confidence: UNKNOWN

java.lang.AssertionError: 
(8 more lines...)
Collapse Failed ConstructorReferenceSearchTests testNewifyConstructorReferences2 History
Default Job < 1 sec
java.lang.AssertionError: expected:<1> but was:<0>
	at org.eclipse.jdt.core.groovy.tests.search.ConstructorReferenceSearchTests.testNewifyConstructorReferences2(ConstructorReferenceSearchTests.java:470)
Collapse Failed ConstructorReferenceSearchTests testConstructorReferences11a History
Default Job < 1 sec
java.lang.AssertionError: expected:<1> but was:<0>
	at org.eclipse.jdt.core.groovy.tests.search.ConstructorReferenceSearchTests.testConstructorReferences11a(ConstructorReferenceSearchTests.java:292)
Collapse Failed ConstructorReferenceSearchTests testConstructorReferences1 History
Default Job < 1 sec
java.lang.AssertionError: Incorrect number of matches; expected:<3> but was:<1>
	at org.eclipse.jdt.core.groovy.tests.search.ConstructorReferenceSearchTests.testConstructorReferences1(ConstructorReferenceSearchTests.java:57)