Build: #477 failed Code changes detected

Build result summary

Details

Completed
Duration
73 minutes
Labels
None
Revision
9654803ca4ab63781d2c7b1a1e7843ac043b0417 9654803ca4ab63781d2c7b1a1e7843ac043b0417
Total tests
5876
Failing since
#476 (Changes by Eric Milles)
Fixed in
#481 (Changes by Eric Milles)

Responsible

Code commits

Author Commit Message Commit date
Eric Milles Eric Milles 9654803ca4ab63781d2c7b1a1e7843ac043b0417 m 9654803ca4ab63781d2c7b1a1e7843ac043b0417 Update the Groovy plugin to 4.0.0-alpha-2
#1211
Eric Milles Eric Milles 4f29a6474c1b8671fa009f1aeed81065ec1086cb m 4f29a6474c1b8671fa009f1aeed81065ec1086cb GROOVY-9872
Eric Milles Eric Milles bccad42c7e28c089cbc684f936bece466d4b2472 m bccad42c7e28c089cbc684f936bece466d4b2472 GROOVY-9854
Eric Milles Eric Milles 7ff963816d2e5b577eb84dc2a3bf9566602a20b0 m 7ff963816d2e5b577eb84dc2a3bf9566602a20b0 GROOVY-9855

Tests

New test failures 5
Status Test View job Duration
Collapse Failed BinarySearchTests testFieldRefInInitializer History
Default Job < 1 sec
java.lang.AssertionError: Expecting 1 matches, but found 0

java.lang.AssertionError: 
Expecting 1 matches, but found 0

	at org.eclipse.jdt.core.groovy.tests.search.BinarySearchTests.assertMatches(BinarySearchTests.java:122)
	at org.eclipse.jdt.core.groovy.tests.search.BinarySearchTests.testFieldRefInInitializer(BinarySearchTests.java:185)
Collapse Failed ClosureInferencingTests testWithAndClosure3 History
Default Job < 1 sec
java.lang.AssertionError: Expected type not found.
Expected: java.lang.Void
Found: java.lang.String
Declaring type: null
ASTNode: [email protected][variable: foo]
Confidence: UNKNOWN

java.lang.AssertionError: 
(8 more lines...)
Collapse Failed ClosureInferencingTests testWithAndClosure6 History
Default Job < 1 sec
java.lang.AssertionError: Expected declaring type not found.
 Expect: p.A
 Actual: A
 ASTNode: [email protected][foo]
java.lang.AssertionError: 
Expected declaring type not found.
	Expect: p.A
	Actual: A
(2 more lines...)
Collapse Failed GroovySimpleTests testVisibility[Java 1.8] History
Default Job < 1 sec
junit.framework.ComparisonFailure: Unexpected error running resulting class file for p/Foo.groovy:
--[START]--
java.lang.BootstrapMethodError: java.lang.IllegalAccessError: tried to access class q.Bar from class p.Foo
 at p.Foo.getIt(Foo.groovy:8)
 at org.codehaus.groovy.vmplugin.v8.IndyInterface.fromCache(IndyInterface.java:318)
 at p.Foo.main(Foo.groovy:5)
 at sun.reflect.NativeMethodAccessorImpl.invoke0(Native Method)
 at sun.reflect.NativeMethodAccessorImpl.invoke(NativeMethodAccessorImpl.java:62)
(62 more lines...)
Collapse Failed TypeCheckedTests testTypeChecked9803[Java 1.8] History
Default Job < 1 sec
junit.framework.ComparisonFailure: Unexpected error running resulting class file for Main.groovy:
--[START]--
java.lang.IllegalArgumentException: interface F is not visible from class loader
 at java.lang.reflect.Proxy$ProxyClassFactory.apply(Proxy.java:581)
 at java.lang.reflect.Proxy$ProxyClassFactory.apply(Proxy.java:557)
 at java.lang.reflect.WeakCache$Factory.get(WeakCache.java:230)
 at java.lang.reflect.WeakCache.get(WeakCache.java:127)
 at java.lang.reflect.Proxy.getProxyClass0(Proxy.java:419)
(188 more lines...)
Fixed tests 1
Status Test Failing since View job Duration
Successful InferencingTests testStaticMethod10 History
Failing since build #476 (Changes by Eric Milles) Default Job < 1 sec

Jira issues

IssueDescriptionStatus
Unknown Issue TypeGROOVY-9854Could not obtain issue details from Jira
Unknown Issue TypeGROOVY-9855Could not obtain issue details from Jira
Unknown Issue TypeGROOVY-9872Could not obtain issue details from Jira