Build: #478 failed Changes by Eric Milles

Build result summary

Details

Completed
Duration
75 minutes
Labels
None
Revision
a88e479fba5bed7487103f1507bc5064cb45ad42 a88e479fba5bed7487103f1507bc5064cb45ad42
Total tests
5884
Failing since
#476 (Changes by Eric Milles)
Fixed in
#481 (Changes by Eric Milles)

Responsible

Code commits

Author Commit Message Commit date
Eric Milles Eric Milles a88e479fba5bed7487103f1507bc5064cb45ad42 a88e479fba5bed7487103f1507bc5064cb45ad42 add test cases

Tests

New test failures 2
Status Test View job Duration
Collapse Failed BasicGroovyBuildTests testCopyResourceNonGroovyProject_GRECLIPSE653 History
Default Job < 1 sec
java.lang.AssertionError: File should exist /Project/bin/A.txt
	at org.eclipse.jdt.core.groovy.tests.builder.BasicGroovyBuildTests.testCopyResourceNonGroovyProject_GRECLIPSE653(BasicGroovyBuildTests.java:2760)
Collapse Failed BasicGroovyBuildTests testBuildJavaHelloWorld History
Default Job < 1 sec
java.lang.AssertionError: array lengths differed, expected.length=1 actual.length=2
	at org.eclipse.jdt.core.groovy.tests.builder.BasicGroovyBuildTests.testBuildJavaHelloWorld(BasicGroovyBuildTests.java:205)
Existing test failures 2
Status Test Failing since View job Duration
junit.framework.ComparisonFailure: Unexpected error running resulting class file for p/Foo.groovy:
--[START]--
java.lang.BootstrapMethodError: java.lang.IllegalAccessError: tried to access class q.Bar from class p.Foo
 at p.Foo.getIt(Foo.groovy:8)
 at org.codehaus.groovy.vmplugin.v8.IndyInterface.fromCache(IndyInterface.java:318)
 at p.Foo.main(Foo.groovy:5)
 at sun.reflect.NativeMethodAccessorImpl.invoke0(Native Method)
 at sun.reflect.NativeMethodAccessorImpl.invoke(NativeMethodAccessorImpl.java:62)
(62 more lines...)
junit.framework.ComparisonFailure: Unexpected error running resulting class file for Main.groovy:
--[START]--
java.lang.IllegalArgumentException: interface F is not visible from class loader
 at java.lang.reflect.Proxy$ProxyClassFactory.apply(Proxy.java:581)
 at java.lang.reflect.Proxy$ProxyClassFactory.apply(Proxy.java:557)
 at java.lang.reflect.WeakCache$Factory.get(WeakCache.java:230)
 at java.lang.reflect.WeakCache.get(WeakCache.java:127)
 at java.lang.reflect.Proxy.getProxyClass0(Proxy.java:419)
(188 more lines...)
Fixed tests 3
Status Test Failing since View job Duration
Successful BinarySearchTests testFieldRefInInitializer History
Failing since build #477 (Code changes detected) Default Job < 1 sec
Successful ClosureInferencingTests testWithAndClosure3 History
Failing since build #477 (Code changes detected) Default Job 2 secs
Successful ClosureInferencingTests testWithAndClosure6 History
Failing since build #477 (Code changes detected) Default Job < 1 sec