Build: #532 failed Changes by Eric Milles

Build result summary

Details

Completed
Duration
73 minutes
Labels
None
Revision
9d6d7ee529aa11d2ff9cb193f5fcf328c78b6dee 9d6d7ee529aa11d2ff9cb193f5fcf328c78b6dee
Total tests
6026
Fixed in
#533 (Changes by Eric Milles)

Tests

Responsible

Code commits

Author Commit Message Commit date
Eric Milles Eric Milles 9d6d7ee529aa11d2ff9cb193f5fcf328c78b6dee 9d6d7ee529aa11d2ff9cb193f5fcf328c78b6dee GROOVY-10031
Eric Milles Eric Milles 05000843ab1c70142328fc8db4f80f94c87210c6 05000843ab1c70142328fc8db4f80f94c87210c6 Fix for #1241: ArrayExpression: multi-dimension init has array elem type

Tests

New test failures 2
Status Test View job Duration
Collapse Failed StaticInferencingTests testStaticImport10 History
Default Job < 1 sec
java.lang.AssertionError: Expected token 'dump' at offset 22 to be recognized. Actual: UNKNOWN
	at org.eclipse.jdt.core.groovy.tests.search.StaticInferencingTests.assertKnown(StaticInferencingTests.java:35)
	at org.eclipse.jdt.core.groovy.tests.search.StaticInferencingTests.testStaticImport10(StaticInferencingTests.java:476)
Collapse Failed TypeReferenceSearchTests testInnerTypes3 History
Default Job < 1 sec
java.lang.AssertionError: Wrong number of matches found:
[] expected:<4> but was:<0>
java.lang.AssertionError: 
Wrong number of matches found:
[] expected:<4> but was:<0>
	at org.eclipse.jdt.core.groovy.tests.search.TypeReferenceSearchTests.testInnerTypes3(TypeReferenceSearchTests.java:365)

Jira issues

IssueDescriptionStatus
Unknown Issue TypeGROOVY-10031Could not obtain issue details from Jira