Build: #84 failed Changes by Eric Milles

Build result summary

Details

Completed
Duration
89 minutes
Labels
None
Agent
bamboo-16.af.pivotal.io
Revision
f49cec65ce464fa0fbf731036b97b0855cb09a5b f49cec65ce464fa0fbf731036b97b0855cb09a5b
Total tests
6084
Fixed in
#87 (Changes by Eric Milles)

Tests

Responsible

Code commits

Author Commit Message Commit date
Eric Milles Eric Milles f49cec65ce464fa0fbf731036b97b0855cb09a5b f49cec65ce464fa0fbf731036b97b0855cb09a5b Fix for #971: off-by-one error in GroovyCompilationUnitDeclaration

Tests

New test failures 5
Status Test View job Duration
Collapse Failed BuildAccessRulesTests testAccessForMethodReturnTypeGenerics History
Default Job < 1 sec
junit.framework.ComparisonFailure: 
----------- Expected ------------
Problem : Access restriction: The type 'BeanInfo' is not API (restriction on required library '##') [ resource : </Project/src/Foo.groovy> range : <39,47> category : <150> severity : <2>]

------------ but was ------------

--------- Difference is ----------
 expected:<[Problem : Access restriction: The type 'BeanInfo' is not API (restriction on required library '##') [ resource : </Project/src/Foo.groovy> range : <39,47> category : <150> severity : <2>]
(13 more lines...)
Collapse Failed BinarySearchTests testClassDecl2 History
Default Job 1 sec
java.lang.AssertionError: Expecting 4 matches, but found 0

java.lang.AssertionError: 
Expecting 4 matches, but found 0

	at org.eclipse.jdt.core.groovy.tests.search.BinarySearchTests.assertMatches(BinarySearchTests.java:139)
	at org.eclipse.jdt.core.groovy.tests.search.BinarySearchTests.testClassDecl2(BinarySearchTests.java:172)
Collapse Failed ClosureInferencingTests testWithAndClosure6 History
Default Job < 1 sec
java.lang.AssertionError: Expected declaring type not found.
 Expected: p.A
 Found type: java.lang.String
 Found declaring type: A
 ASTNode: org.codehaus.groovy.ast.expr.ConstantExpression@1146f6[foo]
java.lang.AssertionError: 
Expected declaring type not found.
	Expected: p.A
(4 more lines...)
Collapse Failed ConstructorReferenceSearchTests testConstructorReferences11a History
Default Job < 1 sec
java.lang.AssertionError: expected:<3> but was:<0>
	at org.eclipse.jdt.core.groovy.tests.search.ConstructorReferenceSearchTests.testConstructorReferences11a(ConstructorReferenceSearchTests.java:295)
Collapse Failed DGMInferencingTests testDGM7 History
Default Job < 1 sec
java.lang.AssertionError: Expected type not found.
Expected: java.lang.String
Found: java.lang.Object
Declaring type: Search
ASTNode: org.codehaus.groovy.ast.expr.VariableExpression@f0080[variable: key]
Confidence: INFERRED

java.lang.AssertionError: 
(9 more lines...)