Build: #86 failed Changes by Eric Milles

Build result summary

Details

Completed
Duration
91 minutes
Labels
None
Agent
bamboo-24.af.pivotal.io
Revision
b929c95d2b3869cc461f2ebbf41bbf08afeeb5a6 b929c95d2b3869cc461f2ebbf41bbf08afeeb5a6
Total tests
6088
Failing since
#84 (Changes by Eric Milles)
Fixed in
#87 (Changes by Eric Milles)

Responsible

Code commits

Author Commit Message Commit date
Eric Milles Eric Milles b929c95d2b3869cc461f2ebbf41bbf08afeeb5a6 b929c95d2b3869cc461f2ebbf41bbf08afeeb5a6 Fix for #974: resolver to inner of super and check visibility
GROOVY-8531, GROOVY-9281

Tests

New test failures 2
Status Test View job Duration
Collapse Failed ClosureInferencingTests testClosure16 History
Default Job < 1 sec
java.lang.AssertionError: Expected type not found.
Expected: C
Found: java.lang.Object
Declaring type: B
ASTNode: org.codehaus.groovy.ast.expr.VariableExpression@11d5c2[variable: xxx]
Confidence: UNKNOWN

java.lang.AssertionError: 
(8 more lines...)
Collapse Failed DGMInferencingTests testDGMClosure13 History
Default Job < 1 sec
java.lang.AssertionError: Expected type not found.
Expected: java.lang.Integer
Found: java.lang.Object
Declaring type: Search
ASTNode: org.codehaus.groovy.ast.expr.VariableExpression@f3ca0[variable: key]
Confidence: INFERRED

java.lang.AssertionError: 
(9 more lines...)
Fixed tests 1
Status Test Failing since View job Duration
Successful ClosureInferencingTests testClosureReturnType3 History
Failing since build #85 (Changes by Eric Milles) Default Job < 1 sec

Jira issues

IssueDescriptionStatus
Unknown Issue TypeGROOVY-8531Could not obtain issue details from Jira
Unknown Issue TypeGROOVY-9281Could not obtain issue details from Jira