Build: #107 failed

Job: Default Job failed

Stages & jobs

  1. Default Stage

Job result summary

Completed
Duration
94 minutes
Agent
bamboo-15.af.pivotal.io
Revision
8c892b0df5f9257066da38aa0bed44da223593cf 8c892b0df5f9257066da38aa0bed44da223593cf
Total tests
6135
Failing since
#101 (Code changes detected – )
Fixed in
#118 (Code changes detected)

Tests

  • 6,135 tests in total
  • 8 tests failed
  • 8 failures are new
  • 1 test was fixed
  • 121 tests were quarantined / skipped
  • 87 minutes taken in total.
New test failures 8
Status Test Duration
Collapse Failed SyntheticMemberSearchTests testSearchInGroovy1 History
1 sec
java.lang.AssertionError: Wrong number of matches found in:
 expected:<3> but was:<0>
java.lang.AssertionError: 
Wrong number of matches found in:
 expected:<3> but was:<0>
	at org.codehaus.groovy.eclipse.core.test.SyntheticMemberSearchTests.assertNumMatch(SyntheticMemberSearchTests.groovy:291)
	at org.codehaus.groovy.eclipse.core.test.SyntheticMemberSearchTests.testSearchInGroovy1(SyntheticMemberSearchTests.groovy:72)
Collapse Failed SyntheticMemberSearchTests testSearchInJava1 History
4 secs
java.lang.AssertionError: Wrong number of matches found in:
 expected:<3> but was:<0>
java.lang.AssertionError: 
Wrong number of matches found in:
 expected:<3> but was:<0>
	at org.codehaus.groovy.eclipse.core.test.SyntheticMemberSearchTests.assertNumMatch(SyntheticMemberSearchTests.groovy:291)
	at org.codehaus.groovy.eclipse.core.test.SyntheticMemberSearchTests.testSearchInJava1(SyntheticMemberSearchTests.groovy:171)
Collapse Failed SyntheticMemberSearchTests testSearchInJava2 History
1 sec
java.lang.AssertionError: Wrong number of matches found in:
 expected:<1> but was:<0>
java.lang.AssertionError: 
Wrong number of matches found in:
 expected:<1> but was:<0>
	at org.codehaus.groovy.eclipse.core.test.SyntheticMemberSearchTests.assertNumMatch(SyntheticMemberSearchTests.groovy:291)
	at org.codehaus.groovy.eclipse.core.test.SyntheticMemberSearchTests.testSearchInJava2(SyntheticMemberSearchTests.groovy:193)
Collapse Failed SyntheticMemberSearchTests testSearchInJava3 History
1 sec
java.lang.AssertionError: Wrong number of matches found in:
 expected:<1> but was:<0>
java.lang.AssertionError: 
Wrong number of matches found in:
 expected:<1> but was:<0>
	at org.codehaus.groovy.eclipse.core.test.SyntheticMemberSearchTests.assertNumMatch(SyntheticMemberSearchTests.groovy:291)
	at org.codehaus.groovy.eclipse.core.test.SyntheticMemberSearchTests.testSearchInJava3(SyntheticMemberSearchTests.groovy:215)
Collapse Failed SyntheticMemberSearchTests testSearchInJava4 History
1 sec
java.lang.AssertionError: Wrong number of matches found in:
 expected:<1> but was:<0>
java.lang.AssertionError: 
Wrong number of matches found in:
 expected:<1> but was:<0>
	at org.codehaus.groovy.eclipse.core.test.SyntheticMemberSearchTests.assertNumMatch(SyntheticMemberSearchTests.groovy:291)
	at org.codehaus.groovy.eclipse.core.test.SyntheticMemberSearchTests.testSearchInJava4(SyntheticMemberSearchTests.groovy:237)
Collapse Failed ConstructorReferenceSearchTests testConstructorReferences12a History
< 1 sec
java.lang.AssertionError: expected:<3> but was:<0>
	at org.eclipse.jdt.core.groovy.tests.search.ConstructorReferenceSearchTests.testConstructorReferences12a(ConstructorReferenceSearchTests.java:332)
Collapse Failed ConstructorReferenceSearchTests testNewifyConstructorReferences2 History
< 1 sec
java.lang.AssertionError: expected:<2> but was:<0>
	at org.eclipse.jdt.core.groovy.tests.search.ConstructorReferenceSearchTests.testNewifyConstructorReferences2(ConstructorReferenceSearchTests.java:408)
Collapse Failed TypeReferenceSearchTests testFindClassDeclarationWithPattern History
< 1 sec
java.lang.AssertionError: Number of results found expected:<2> but was:<0>
	at org.eclipse.jdt.core.groovy.tests.search.TypeReferenceSearchTests.testFindClassDeclarationWithPattern(TypeReferenceSearchTests.java:220)
Fixed tests 1
Status Test Failing since Duration
Successful BasicGroovyBuildTests testTraitGenerics History
Failing since build #106 (Code changes detected) < 1 sec

Error summary

The build generated some errors. See the full build log for more details.

Nov 04, 2019 8:10:26 PM org.apache.http.impl.execchain.RetryExec execute
INFO: I/O exception (org.apache.http.NoHttpResponseException) caught when processing request to {s}->https://download.eclipse.org:443: The target server failed to respond
Nov 04, 2019 8:10:26 PM org.apache.http.impl.execchain.RetryExec execute
INFO: Retrying request to {s}->https://download.eclipse.org:443
Nov 04, 2019 8:10:55 PM org.apache.http.impl.execchain.RetryExec execute
INFO: I/O exception (org.apache.http.NoHttpResponseException) caught when processing request to {s}->https://download.eclipse.org:443: The target server failed to respond
Nov 04, 2019 8:10:55 PM org.apache.http.impl.execchain.RetryExec execute
INFO: Retrying request to {s}->https://download.eclipse.org:443
Nov 04, 2019 8:10:57 PM org.apache.http.impl.execchain.RetryExec execute
INFO: I/O exception (org.apache.http.NoHttpResponseException) caught when processing request to {s}->https://download.eclipse.org:443: The target server failed to respond
Nov 04, 2019 8:10:57 PM org.apache.http.impl.execchain.RetryExec execute
INFO: Retrying request to {s}->https://download.eclipse.org:443
Nov 04, 2019 8:11:00 PM org.apache.http.impl.execchain.RetryExec execute
INFO: I/O exception (org.apache.http.NoHttpResponseException) caught when processing request to {s}->https://download.eclipse.org:443: The target server failed to respond
Nov 04, 2019 8:11:00 PM org.apache.http.impl.execchain.RetryExec execute
INFO: Retrying request to {s}->https://download.eclipse.org:443
Nov 04, 2019 8:11:02 PM org.apache.http.impl.execchain.RetryExec execute
INFO: I/O exception (org.apache.http.NoHttpResponseException) caught when processing request to {s}->https://download.eclipse.org:443: The target server failed to respond
Nov 04, 2019 8:11:02 PM org.apache.http.impl.execchain.RetryExec execute
INFO: Retrying request to {s}->https://download.eclipse.org:443
Nov 04, 2019 8:11:06 PM org.apache.http.impl.execchain.RetryExec execute
INFO: I/O exception (org.apache.http.NoHttpResponseException) caught when processing request to {s}->https://download.eclipse.org:443: The target server failed to respond
Nov 04, 2019 8:11:06 PM org.apache.http.impl.execchain.RetryExec execute
INFO: Retrying request to {s}->https://download.eclipse.org:443
Nov 04, 2019 8:11:14 PM org.apache.http.impl.execchain.RetryExec execute
INFO: I/O exception (org.apache.http.NoHttpResponseException) caught when processing request to {s}->https://download.eclipse.org:443: The target server failed to respond
Nov 04, 2019 8:11:14 PM org.apache.http.impl.execchain.RetryExec execute
INFO: Retrying request to {s}->https://download.eclipse.org:443
Nov 04, 2019 8:11:27 PM org.apache.http.impl.execchain.RetryExec execute
INFO: I/O exception (org.apache.http.NoHttpResponseException) caught when processing request to {s}->https://download.eclipse.org:443: The target server failed to respond
Nov 04, 2019 8:11:27 PM org.apache.http.impl.execchain.RetryExec execute
INFO: Retrying request to {s}->https://download.eclipse.org:443
Nov 04, 2019 8:11:40 PM org.apache.http.impl.execchain.RetryExec execute
INFO: I/O exception (org.apache.http.NoHttpResponseException) caught when processing request to {s}->https://download.eclipse.org:443: The target server failed to respond
Nov 04, 2019 8:11:40 PM org.apache.http.impl.execchain.RetryExec execute
INFO: Retrying request to {s}->https://download.eclipse.org:443
Nov 04, 2019 8:13:03 PM org.apache.http.impl.execchain.RetryExec execute
INFO: I/O exception (org.apache.http.NoHttpResponseException) caught when processing request to {s}->https://download.eclipse.org:443: The target server failed to respond
Nov 04, 2019 8:13:03 PM org.apache.http.impl.execchain.RetryExec execute
INFO: Retrying request to {s}->https://download.eclipse.org:443
Nov 04, 2019 8:13:05 PM org.apache.http.impl.execchain.RetryExec execute
INFO: I/O exception (org.apache.http.NoHttpResponseException) caught when processing request to {s}->https://download.eclipse.org:443: The target server failed to respond
Nov 04, 2019 8:13:05 PM org.apache.http.impl.execchain.RetryExec execute
INFO: Retrying request to {s}->https://download.eclipse.org:443
Nov 04, 2019 8:13:28 PM org.apache.http.impl.execchain.RetryExec execute
INFO: I/O exception (org.apache.http.NoHttpResponseException) caught when processing request to {s}->https://download.eclipse.org:443: The target server failed to respond
Nov 04, 2019 8:13:28 PM org.apache.http.impl.execchain.RetryExec execute
INFO: Retrying request to {s}->https://download.eclipse.org:443
SWT SessionManagerDBus: Failed to connect to org.gnome.SessionManager: Failed to execute child process “dbus-launch” (No such file or directory)
SWT SessionManagerDBus: Failed to connect to org.xfce.SessionManager: Failed to execute child process “dbus-launch” (No such file or directory)
TypeInferencingVisitorWithRequestor.findMethodNode: no match found for Main.main([Qjava.lang.String;)
TypeInferencingVisitorWithRequestor.findMethodNode: no match found for Main.main([Qjava.lang.String;)
CodeSelectRequestor: Could not proceed due to null declaring type for org.codehaus.groovy.ast.expr.BinaryExpression@ecbea[org.codehaus.groovy.ast.expr.VariableExpression@ecbe3[variable: it]("in" at 1:20:  "in" )org.codehaus.groovy.ast.expr.ListExpression@ee270[]]
CodeSelectRequestor: Could not proceed due to null declaring type for org.codehaus.groovy.ast.expr.RangeExpression@ebcdd
CodeSelectRequestor: Could not proceed due to null declaring type for org.codehaus.groovy.ast.expr.RangeExpression@ebcde
TypeInferencingVisitorWithRequestor.findMethodNode: no match found for Type.x(QList<Qjava.util.Date;>;)
TypeInferencingVisitorWithRequestor.findMethodNode: no match found for Type.x(QList<Qjava.lang.Number;>;)
TypeInferencingVisitorWithRequestor.findMethodNode: no match found for Type.x(QList<Qjava.lang.Number;>;)
TypeInferencingVisitorWithRequestor.findMethodNode: no match found for Type.x(QList<Qjava.util.Date;>;)
TypeInferencingVisitorWithRequestor.findMethodNode: no match found for Type.x(QList<Qjava.lang.Number;>;)
TypeInferencingVisitorWithRequestor.findMethodNode: no match found for Type.x(QList<Qjava.lang.Number;>;)
CodeSelectRequestor: Could not proceed due to null declaring type for org.codehaus.groovy.ast.expr.ConstantExpression@e8fc6[fff]
CodeSelectRequestor: Could not proceed due to null declaring type for org.codehaus.groovy.ast.expr.ConstantExpression@e8fca[fff]
CodeSelectRequestor: Could not proceed due to null declaring type for org.codehaus.groovy.ast.expr.ConstantExpression@e8fca[fff]
Waiting for: Java indexing... 17 files to index (/opt/jdk8u232-b09/jre/lib/rt.jar)
Waiting for: Java indexing... 16 files to index (/Project)
Waiting for: Java indexing... 22 files to index (/Project)
Waiting for: Java indexing... 22 files to index (/Project)
Waiting for: Java indexing... 22 files to index (/Project)
Waiting for: Java indexing... 22 files to index (/Project)
Waiting for: Java indexing... 22 files to index (/Project)
Waiting for: Java indexing... 21 files to index (/Project)
Waiting for: Java indexing... 16 files to index (/Project)
Waiting for: Java indexing... 21 files to index (/Project)
Waiting for: Java indexing... 3 files to index (/Project)