Build: #110 failed

Job: Default Job failed

Stages & jobs

  1. Default Stage

Job result summary

Completed
Duration
92 minutes
Agent
bamboo-16.af.pivotal.io
Revision
c2eb5eb2148a0754333f8f5e8ecc69c6625bab60 c2eb5eb2148a0754333f8f5e8ecc69c6625bab60
Total tests
6135
Failing since
#101 (Code changes detected – )
Fixed in
#118 (Code changes detected)

Tests

  • 6,135 tests in total
  • 7 tests failed
  • 7 failures are new
  • 2 tests were fixed
  • 121 tests were quarantined / skipped
  • 87 minutes taken in total.
New test failures 7
Status Test Duration
Collapse Failed BuildAccessRulesTests testAccessForExtends History
< 1 sec
junit.framework.ComparisonFailure: 
----------- Expected ------------
Problem : Access restriction: The type 'BeanDescriptor' is not API (restriction on required library '##') [ resource : </Project/src/Foo.groovy> range : <38,52> category : <150> severity : <2>]

------------ but was ------------

--------- Difference is ----------
 expected:<[Problem : Access restriction: The type 'BeanDescriptor' is not API (restriction on required library '##') [ resource : </Project/src/Foo.groovy> range : <38,52> category : <150> severity : <2>]
(13 more lines...)
Collapse Failed BuildAccessRulesTests testAccessForField History
< 1 sec
junit.framework.ComparisonFailure: 
----------- Expected ------------
Problem : Access restriction: The type 'BeanInfo' is not API (restriction on required library '##') [ resource : </Project/src/Foo.groovy> range : <42,50> category : <150> severity : <2>]

------------ but was ------------

--------- Difference is ----------
 expected:<[Problem : Access restriction: The type 'BeanInfo' is not API (restriction on required library '##') [ resource : </Project/src/Foo.groovy> range : <42,50> category : <150> severity : <2>]
(13 more lines...)
Collapse Failed BuildAccessRulesTests testAccessForMethodReturnType History
< 1 sec
junit.framework.ComparisonFailure: 
----------- Expected ------------
Problem : Access restriction: The type 'BeanInfo' is not API (restriction on required library '##') [ resource : </Project/src/Foo.groovy> range : <34,42> category : <150> severity : <2>]

------------ but was ------------

--------- Difference is ----------
 expected:<[Problem : Access restriction: The type 'BeanInfo' is not API (restriction on required library '##') [ resource : </Project/src/Foo.groovy> range : <34,42> category : <150> severity : <2>]
(13 more lines...)
Collapse Failed BinarySearchTests testFieldRefInInitializer History
1 sec
java.lang.AssertionError: Expecting 1 matches, but found 0

java.lang.AssertionError: 
Expecting 1 matches, but found 0

	at org.eclipse.jdt.core.groovy.tests.search.BinarySearchTests.assertMatches(BinarySearchTests.java:139)
	at org.eclipse.jdt.core.groovy.tests.search.BinarySearchTests.testFieldRefInInitializer(BinarySearchTests.java:208)
Collapse Failed ClosureInferencingTests testClosure25 History
< 1 sec
java.lang.AssertionError: Expected type not found.
Expected: java.lang.Void
Found: java.lang.Long
Declaring type: Search
ASTNode: org.codehaus.groovy.ast.expr.VariableExpression@f0bc7[variable: time]
Confidence: INFERRED

java.lang.AssertionError: 
(8 more lines...)
Collapse Failed ClosureInferencingTests testClosureReturnType4 History
< 1 sec
java.lang.AssertionError: Expected type not found.
Expected: Foo[]
Found: java.lang.String
Declaring type: Search
ASTNode: org.codehaus.groovy.ast.expr.VariableExpression@1070c4[variable: arr]
Confidence: INFERRED

java.lang.AssertionError: 
(8 more lines...)
Collapse Failed TypeReferenceSearchTests testFindClassDeclarationWithPattern History
< 1 sec
java.lang.AssertionError: Expected but not found: SongTests (not open) [in SongTests.groovy [in gtunes [in src [in Project]]]]
Expected but not found: ArtistTests (not open) [in ArtistTests.groovy [in gtunes [in src [in Project]]]]
Found but not expected: class ArtistTests [in ArtistTests.groovy [in src.gtunes [in <project root> [in Project]]]]
  java.lang.Object testSomething()
Found but not expected: class SongTests [in SongTests.groovy [in src.gtunes [in <project root> [in Project]]]]
  java.lang.Object testSomething()

java.lang.AssertionError: 
(9 more lines...)
Fixed tests 2
Status Test Failing since Duration
Successful BasicGroovyBuildTests testSlowAnotherAttempt_GRE870 History
Failing since build #109 (Code changes detected) < 1 sec
Successful InferencingTests testMethodOverloadsArgumentMatching7 History
Failing since build #109 (Code changes detected) < 1 sec

Error summary

The build generated some errors. See the full build log for more details.

Nov 06, 2019 3:18:15 AM org.apache.http.impl.execchain.RetryExec execute
INFO: I/O exception (org.apache.http.NoHttpResponseException) caught when processing request to {s}->https://download.eclipse.org:443: The target server failed to respond
Nov 06, 2019 3:18:15 AM org.apache.http.impl.execchain.RetryExec execute
INFO: Retrying request to {s}->https://download.eclipse.org:443
Nov 06, 2019 3:18:36 AM org.apache.http.impl.execchain.RetryExec execute
INFO: I/O exception (org.apache.http.NoHttpResponseException) caught when processing request to {s}->https://download.eclipse.org:443: The target server failed to respond
Nov 06, 2019 3:18:36 AM org.apache.http.impl.execchain.RetryExec execute
INFO: Retrying request to {s}->https://download.eclipse.org:443
Nov 06, 2019 3:18:38 AM org.apache.http.impl.execchain.RetryExec execute
INFO: I/O exception (org.apache.http.NoHttpResponseException) caught when processing request to {s}->https://download.eclipse.org:443: The target server failed to respond
Nov 06, 2019 3:18:38 AM org.apache.http.impl.execchain.RetryExec execute
INFO: Retrying request to {s}->https://download.eclipse.org:443
Nov 06, 2019 3:18:40 AM org.apache.http.impl.execchain.RetryExec execute
INFO: I/O exception (org.apache.http.NoHttpResponseException) caught when processing request to {s}->https://download.eclipse.org:443: The target server failed to respond
Nov 06, 2019 3:18:40 AM org.apache.http.impl.execchain.RetryExec execute
INFO: Retrying request to {s}->https://download.eclipse.org:443
Nov 06, 2019 3:18:53 AM org.apache.http.impl.execchain.RetryExec execute
INFO: I/O exception (org.apache.http.NoHttpResponseException) caught when processing request to {s}->https://download.eclipse.org:443: The target server failed to respond
Nov 06, 2019 3:18:53 AM org.apache.http.impl.execchain.RetryExec execute
INFO: Retrying request to {s}->https://download.eclipse.org:443
Nov 06, 2019 3:18:57 AM org.apache.http.impl.execchain.RetryExec execute
INFO: I/O exception (org.apache.http.NoHttpResponseException) caught when processing request to {s}->https://download.eclipse.org:443: The target server failed to respond
Nov 06, 2019 3:18:57 AM org.apache.http.impl.execchain.RetryExec execute
INFO: Retrying request to {s}->https://download.eclipse.org:443
Nov 06, 2019 3:19:04 AM org.apache.http.impl.execchain.RetryExec execute
INFO: I/O exception (org.apache.http.NoHttpResponseException) caught when processing request to {s}->https://download.eclipse.org:443: The target server failed to respond
Nov 06, 2019 3:19:04 AM org.apache.http.impl.execchain.RetryExec execute
INFO: Retrying request to {s}->https://download.eclipse.org:443
Nov 06, 2019 3:19:16 AM org.apache.http.impl.execchain.RetryExec execute
INFO: I/O exception (org.apache.http.NoHttpResponseException) caught when processing request to {s}->https://download.eclipse.org:443: The target server failed to respond
Nov 06, 2019 3:19:16 AM org.apache.http.impl.execchain.RetryExec execute
INFO: Retrying request to {s}->https://download.eclipse.org:443
Nov 06, 2019 3:20:59 AM org.apache.http.impl.execchain.RetryExec execute
INFO: I/O exception (org.apache.http.NoHttpResponseException) caught when processing request to {s}->https://download.eclipse.org:443: The target server failed to respond
Nov 06, 2019 3:20:59 AM org.apache.http.impl.execchain.RetryExec execute
INFO: Retrying request to {s}->https://download.eclipse.org:443
SWT SessionManagerDBus: Failed to connect to org.gnome.SessionManager: Failed to execute child process “dbus-launch” (No such file or directory)
SWT SessionManagerDBus: Failed to connect to org.xfce.SessionManager: Failed to execute child process “dbus-launch” (No such file or directory)
TypeInferencingVisitorWithRequestor.findMethodNode: no match found for Main.main([Qjava.lang.String;)
TypeInferencingVisitorWithRequestor.findMethodNode: no match found for Main.main([Qjava.lang.String;)
CodeSelectRequestor: Could not proceed due to null declaring type for org.codehaus.groovy.ast.expr.BinaryExpression@ecbea[org.codehaus.groovy.ast.expr.VariableExpression@ecbe3[variable: it]("in" at 1:20:  "in" )org.codehaus.groovy.ast.expr.ListExpression@ee270[]]
CodeSelectRequestor: Could not proceed due to null declaring type for org.codehaus.groovy.ast.expr.RangeExpression@ebcdd
CodeSelectRequestor: Could not proceed due to null declaring type for org.codehaus.groovy.ast.expr.RangeExpression@ebcde
TypeInferencingVisitorWithRequestor.findMethodNode: no match found for Type.x(QList<Qjava.util.Date;>;)
TypeInferencingVisitorWithRequestor.findMethodNode: no match found for Type.x(QList<Qjava.lang.Number;>;)
TypeInferencingVisitorWithRequestor.findMethodNode: no match found for Type.x(QList<Qjava.util.Date;>;)
TypeInferencingVisitorWithRequestor.findMethodNode: no match found for Type.x(QList<Qjava.lang.Number;>;)
TypeInferencingVisitorWithRequestor.findMethodNode: no match found for Type.x(QList<Qjava.lang.Number;>;)
CodeSelectRequestor: Could not proceed due to null declaring type for org.codehaus.groovy.ast.expr.ConstantExpression@e8fc6[fff]
CodeSelectRequestor: Could not proceed due to null declaring type for org.codehaus.groovy.ast.expr.ConstantExpression@e8fca[fff]
CodeSelectRequestor: Could not proceed due to null declaring type for org.codehaus.groovy.ast.expr.ConstantExpression@e8fca[fff]
Waiting for: Java indexing... 3 files to index (/Project)
Waiting for: Java indexing... 22 files to index (/Project)
Waiting for: Java indexing... 22 files to index (/Project)
Waiting for: Java indexing... 22 files to index (/Project)
Waiting for: Java indexing... 22 files to index (/Project)
Waiting for: Java indexing... 22 files to index (/Project)
Waiting for: Java indexing... 22 files to index (/Project)
Waiting for: Java indexing... 21 files to index (/Project)
Waiting for: Flushing content description cache.
Waiting for: Java indexing... 21 files to index (/Project)
Waiting for: Flushing content description cache.
Waiting for: Java indexing... 21 files to index (/Project)
Waiting for: Java indexing... 4 files to index (/Project)