Build: #112 failed

Job: Default Job failed

Stages & jobs

  1. Default Stage

Job result summary

Completed
Duration
91 minutes
Agent
bamboo-16.af.pivotal.io
Revision
9217239b97d7c6a469017451e8349a1735fa2fd1 9217239b97d7c6a469017451e8349a1735fa2fd1
Total tests
6142
Failing since
#101 (Code changes detected – )
Fixed in
#118 (Code changes detected)

Tests

  • 6,142 tests in total
  • 21 tests failed
  • 4 failures are new
  • 121 tests were quarantined / skipped
  • 87 minutes taken in total.
New test failures 4
Status Test Duration
Collapse Failed BinarySearchTests testClassDecl1 History
1 sec
java.lang.AssertionError: Expecting 12 matches, but found 0

java.lang.AssertionError: 
Expecting 12 matches, but found 0

	at org.eclipse.jdt.core.groovy.tests.search.BinarySearchTests.assertMatches(BinarySearchTests.java:139)
	at org.eclipse.jdt.core.groovy.tests.search.BinarySearchTests.testClassDecl1(BinarySearchTests.java:165)
Collapse Failed BinarySearchTests testFieldDecl2 History
1 sec
java.lang.AssertionError: Expecting 2 matches, but found 0

java.lang.AssertionError: 
Expecting 2 matches, but found 0

	at org.eclipse.jdt.core.groovy.tests.search.BinarySearchTests.assertMatches(BinarySearchTests.java:139)
	at org.eclipse.jdt.core.groovy.tests.search.BinarySearchTests.testFieldDecl2(BinarySearchTests.java:190)
Collapse Failed ConstructorReferenceSearchTests testConstructorReferences4 History
< 1 sec
java.lang.AssertionError: expected:<2> but was:<0>
	at org.eclipse.jdt.core.groovy.tests.search.ConstructorReferenceSearchTests.testConstructorReferences4(ConstructorReferenceSearchTests.java:144)
Collapse Failed Groovy21InferencingTests testDelegatesToTypeName3 History
< 1 sec
java.lang.AssertionError: Expected type not found.
Expected: java.lang.Number
Found: java.lang.Object
Declaring type: Search
ASTNode: org.codehaus.groovy.ast.expr.VariableExpression@100f13[variable: number]
Confidence: UNKNOWN

java.lang.AssertionError: 
(8 more lines...)
Existing test failures 17
Status Test Failing since Duration
org.junit.ComparisonFailure: invalid renaming expected:<...ef s() {
        "${[g}"
        "${this.g]}"
    }
}> but was:<...ef s() {
        "${[f}"
        "${this.f]}"
    }
(15 more lines...)
org.junit.ComparisonFailure: invalid renaming expected:<...port static o.Other.[BAR

BAR
o.Other.BAR]> but was:<...port static o.Other.[FOO

FOO
o.Other.FOO]>
org.junit.ComparisonFailure: 
(9 more lines...)
org.junit.ComparisonFailure: invalid renaming expected:<...2 = new MyBean(foo: [g].foo)
 }
}> but was:<...2 = new MyBean(foo: [f].foo)
 }
}>
org.junit.ComparisonFailure: 
invalid renaming expected:<...2 = new MyBean(foo: [g].foo)
	}
(5 more lines...)
org.junit.ComparisonFailure: invalid renaming expected:<...tBar(Class bar) {
  [baz = bar
 }
}

@CompileStatic
class A {
 def f = new MyBean()
(41 more lines...)
org.junit.ComparisonFailure: invalid renaming expected:<...oid s() {
        c.[g = 3
        def f =  {f -> println(f)}
        c.g()
    }
}

class A {
(51 more lines...)
org.junit.ComparisonFailure: invalid renaming expected:<... void s() {
        [g = g
        this.g = super.g
    }
}

class A extends C {
    def g = 7
(59 more lines...)
org.junit.ComparisonFailure: invalid renaming expected:<...     this.f = super.[g]
    }
}

class A {
...> but was:<...     this.f = super.[f]
    }
}
(19 more lines...)
org.junit.ComparisonFailure: invalid renaming expected:<...s A {
    {
        [g = g
        while (true) {
            def f = this.g
            f++
        }
        g]++
(34 more lines...)
org.junit.ComparisonFailure: invalid renaming expected:<... {
        f = this.[g]
    }
}> but was:<... {
        f = this.[f]
    }
}>
org.junit.ComparisonFailure: 
(11 more lines...)
org.junit.ComparisonFailure: invalid renaming expected:<...->
        f = this.[g]
    }
}> but was:<...->
        f = this.[f]
    }
}>
org.junit.ComparisonFailure: 
(10 more lines...)
org.junit.ComparisonFailure: invalid renaming expected:<...s() {
        f = A.[g
        f = super.g
    }
}

class A extends C {
    static g = 7
(63 more lines...)
org.junit.ComparisonFailure: invalid renaming expected:<...c def s() {
        [g = A.g
    }
}

class B extends A {
    public def f
    void m() {
(59 more lines...)
org.junit.ComparisonFailure: invalid renaming expected:<... p
class A { 
    { [g }
    def g
    def other = g
    def doOperation= { g }
    { g] }
}> but was:<... p
(27 more lines...)
org.junit.ComparisonFailure: invalid renaming expected:<... 
    A() { }
    { [g }
    def g
    def other = g
    def doOperation= { g }
    { g] }
}> but was:<... 
(27 more lines...)
org.junit.ComparisonFailure: invalid renaming expected:<...   A(a,b) { }
    { [g }
    def g
    def other = g
    def doOperation= { g }
    { g] }
}> but was:<...   A(a,b) { }
    { [f }
(23 more lines...)
org.junit.ComparisonFailure: invalid renaming expected:<...f val = new B()
val.[g

def val2 = ""
val2.f
val2 = val
val2.g]

(42 more lines...)
org.junit.ComparisonFailure: invalid renaming expected:<...f val = new C()
val.[g

def val2 = ""
val2.f
val2 = val
val2.g]

(34 more lines...)

Error summary

The build generated some errors. See the full build log for more details.

Nov 08, 2019 2:38:17 AM org.apache.http.impl.execchain.RetryExec execute
INFO: I/O exception (org.apache.http.NoHttpResponseException) caught when processing request to {s}->https://download.eclipse.org:443: The target server failed to respond
Nov 08, 2019 2:38:17 AM org.apache.http.impl.execchain.RetryExec execute
INFO: Retrying request to {s}->https://download.eclipse.org:443
SWT SessionManagerDBus: Failed to connect to org.gnome.SessionManager: Failed to execute child process “dbus-launch” (No such file or directory)
SWT SessionManagerDBus: Failed to connect to org.xfce.SessionManager: Failed to execute child process “dbus-launch” (No such file or directory)
TypeInferencingVisitorWithRequestor.findMethodNode: no match found for Main.main([Qjava.lang.String;)
TypeInferencingVisitorWithRequestor.findMethodNode: no match found for Main.main([Qjava.lang.String;)
CodeSelectRequestor: Could not proceed due to null declaring type for org.codehaus.groovy.ast.expr.BinaryExpression@ecbea[org.codehaus.groovy.ast.expr.VariableExpression@ecbe3[variable: it]("in" at 1:20:  "in" )org.codehaus.groovy.ast.expr.ListExpression@ee270[]]
CodeSelectRequestor: Could not proceed due to null declaring type for org.codehaus.groovy.ast.expr.RangeExpression@ebcdd
CodeSelectRequestor: Could not proceed due to null declaring type for org.codehaus.groovy.ast.expr.RangeExpression@ebcde
TypeInferencingVisitorWithRequestor.findMethodNode: no match found for Type.x(QList<Qjava.util.Date;>;)
TypeInferencingVisitorWithRequestor.findMethodNode: no match found for Type.x(QList<Qjava.lang.Number;>;)
TypeInferencingVisitorWithRequestor.findMethodNode: no match found for Type.x(QList<Qjava.lang.Number;>;)
TypeInferencingVisitorWithRequestor.findMethodNode: no match found for Type.x(QList<Qjava.util.Date;>;)
TypeInferencingVisitorWithRequestor.findMethodNode: no match found for Type.x(QList<Qjava.lang.Number;>;)
TypeInferencingVisitorWithRequestor.findMethodNode: no match found for Type.x(QList<Qjava.lang.Number;>;)
CodeSelectRequestor: Could not proceed due to null declaring type for org.codehaus.groovy.ast.expr.ConstantExpression@e8fc6[fff]
CodeSelectRequestor: Could not proceed due to null declaring type for org.codehaus.groovy.ast.expr.ConstantExpression@e8fca[fff]
CodeSelectRequestor: Could not proceed due to null declaring type for org.codehaus.groovy.ast.expr.ConstantExpression@e8fca[fff]
Waiting for: Java indexing... 3 files to index (/Project)
Waiting for: Java indexing... 22 files to index (/Project)
Waiting for: Java indexing... 22 files to index (/Project)
Waiting for: Java indexing... 22 files to index (/Project)
Waiting for: Java indexing... 22 files to index (/Project)
Waiting for: Java indexing... 22 files to index (/Project)
Waiting for: Java indexing... 22 files to index (/Project)
Waiting for: Java indexing... 21 files to index (/Project)
Waiting for: Java indexing... 21 files to index (/Project)
Waiting for: Java indexing... 21 files to index (/Project)
Waiting for: Flushing content description cache.
Waiting for: Java indexing... 3 files to index (/Project)