Build: #113 failed

Job: Default Job failed

Stages & jobs

  1. Default Stage

Job result summary

Completed
Duration
91 minutes
Agent
bamboo-16.af.pivotal.io
Revision
7d8c5d1afee9e188f10246b8eeb77d67395dde0c 7d8c5d1afee9e188f10246b8eeb77d67395dde0c
Total tests
6145
Failing since
#101 (Code changes detected – )
Fixed in
#118 (Code changes detected)

Tests

  • 6,145 tests in total
  • 6 tests failed
  • 6 failures are new
  • 21 tests were fixed
  • 121 tests were quarantined / skipped
  • 87 minutes taken in total.
New test failures 6
Status Test Duration
Collapse Failed GroovyContentTypeTests testGroovyThenJavaProject History
< 1 sec
java.lang.AssertionError: L/Project/bin/p1/HelloJava.class should exist
	at org.eclipse.jdt.core.groovy.tests.model.GroovyContentTypeTests.checkJavaProject(GroovyContentTypeTests.java:152)
	at org.eclipse.jdt.core.groovy.tests.model.GroovyContentTypeTests.testGroovyThenJavaProject(GroovyContentTypeTests.java:90)
Collapse Failed ArrayInferencingTests testArray6 History
< 1 sec
java.lang.AssertionError: Expected type not found.
Expected: java.lang.CharSequence
Found: java.lang.CharSequence[]
Declaring type: null
ASTNode: org.codehaus.groovy.ast.expr.BinaryExpression@f47e7[org.codehaus.groovy.ast.expr.VariableExpression@f47e4[variable: x]("[" at 1:51:  "[" )org.codehaus.groovy.ast.expr.VariableExpression@f4f68[variable: i type: java.lang.Integer]]
Confidence: EXACT

java.lang.AssertionError: 
(8 more lines...)
Collapse Failed ArrayInferencingTests testArrayProperty5 History
< 1 sec
java.lang.AssertionError: Expected type not found.
Expected: XX
Found: java.lang.String
Declaring type: java.lang.String
ASTNode: org.codehaus.groovy.ast.expr.ConstantExpression@edead[yy]
Confidence: UNKNOWN

java.lang.AssertionError: 
(8 more lines...)
Collapse Failed BinarySearchTests testClassDecl2 History
1 sec
java.lang.AssertionError: Expecting 4 matches, but found 0

java.lang.AssertionError: 
Expecting 4 matches, but found 0

	at org.eclipse.jdt.core.groovy.tests.search.BinarySearchTests.assertMatches(BinarySearchTests.java:139)
	at org.eclipse.jdt.core.groovy.tests.search.BinarySearchTests.testClassDecl2(BinarySearchTests.java:172)
Collapse Failed ConstructorReferenceSearchTests testConstructorReferences1 History
< 1 sec
java.lang.AssertionError: Incorrect number of matches; expected:<3> but was:<0>
	at org.eclipse.jdt.core.groovy.tests.search.ConstructorReferenceSearchTests.testConstructorReferences1(ConstructorReferenceSearchTests.java:59)
Collapse Failed ConstructorReferenceSearchTests testConstructorReferences7 History
< 1 sec
java.lang.AssertionError: expected:<1> but was:<0>
	at org.eclipse.jdt.core.groovy.tests.search.ConstructorReferenceSearchTests.testConstructorReferences7(ConstructorReferenceSearchTests.java:198)
Fixed tests 21
Status Test Failing since Duration
Successful RenameFieldTests test10 History
Failing since build #111 (Code changes detected) 5 secs
Successful RenameFieldTests test11 History
Failing since build #111 (Code changes detected) 1 sec
Successful RenameFieldTests test13 History
Failing since build #111 (Code changes detected) 1 sec
Successful RenameFieldTests test14 History
Failing since build #111 (Code changes detected) 1 sec
Successful RenameFieldTests test2 History
Failing since build #111 (Code changes detected) 1 sec
Successful RenameFieldTests test3 History
Failing since build #111 (Code changes detected) 1 sec
Successful RenameFieldTests test4 History
Failing since build #111 (Code changes detected) 1 sec
Successful RenameFieldTests test5 History
Failing since build #111 (Code changes detected) 1 sec
Successful RenameFieldTests test6 History
Failing since build #111 (Code changes detected) 1 sec
Successful RenameFieldTests test7 History
Failing since build #111 (Code changes detected) 1 sec
Successful RenameFieldTests test8 History
Failing since build #111 (Code changes detected) 1 sec
Successful RenameFieldTests test9 History
Failing since build #111 (Code changes detected) 1 sec
Successful RenameFieldTests testInitializer1 History
Failing since build #111 (Code changes detected) 1 sec
Successful RenameFieldTests testInitializer2 History
Failing since build #111 (Code changes detected) 1 sec
Successful RenameFieldTests testInitializer3 History
Failing since build #111 (Code changes detected) 1 sec
Successful RenameFieldTests testScript1 History
Failing since build #111 (Code changes detected) 1 sec
Successful RenameFieldTests testScript2 History
Failing since build #111 (Code changes detected) 1 sec
Successful BinarySearchTests testClassDecl1 History
Failing since build #112 (Code changes detected) 1 sec
Successful BinarySearchTests testFieldDecl2 History
Failing since build #112 (Code changes detected) 1 sec
Successful ConstructorReferenceSearchTests testConstructorReferences4 History
Failing since build #112 (Code changes detected) < 1 sec
Successful Groovy21InferencingTests testDelegatesToTypeName3 History
Failing since build #112 (Code changes detected) < 1 sec

Error summary

The build generated some errors. See the full build log for more details.

Nov 08, 2019 7:24:48 PM org.apache.http.impl.execchain.RetryExec execute
INFO: I/O exception (org.apache.http.NoHttpResponseException) caught when processing request to {s}->https://download.eclipse.org:443: The target server failed to respond
Nov 08, 2019 7:24:48 PM org.apache.http.impl.execchain.RetryExec execute
INFO: Retrying request to {s}->https://download.eclipse.org:443
SWT SessionManagerDBus: Failed to connect to org.gnome.SessionManager: Failed to execute child process “dbus-launch” (No such file or directory)
SWT SessionManagerDBus: Failed to connect to org.xfce.SessionManager: Failed to execute child process “dbus-launch” (No such file or directory)
TypeInferencingVisitorWithRequestor.findMethodNode: no match found for Main.main([Qjava.lang.String;)
TypeInferencingVisitorWithRequestor.findMethodNode: no match found for Main.main([Qjava.lang.String;)
CodeSelectRequestor: Could not proceed due to null declaring type for org.codehaus.groovy.ast.expr.BinaryExpression@ecbea[org.codehaus.groovy.ast.expr.VariableExpression@ecbe3[variable: it]("in" at 1:20:  "in" )org.codehaus.groovy.ast.expr.ListExpression@ee270[]]
CodeSelectRequestor: Could not proceed due to null declaring type for org.codehaus.groovy.ast.expr.RangeExpression@ebcdd
CodeSelectRequestor: Could not proceed due to null declaring type for org.codehaus.groovy.ast.expr.RangeExpression@ebcde
TypeInferencingVisitorWithRequestor.findMethodNode: no match found for Type.x(QList<Qjava.util.Date;>;)
TypeInferencingVisitorWithRequestor.findMethodNode: no match found for Type.x(QList<Qjava.lang.Number;>;)
TypeInferencingVisitorWithRequestor.findMethodNode: no match found for Type.x(QList<Qjava.util.Date;>;)
TypeInferencingVisitorWithRequestor.findMethodNode: no match found for Type.x(QList<Qjava.lang.Number;>;)
TypeInferencingVisitorWithRequestor.findMethodNode: no match found for Type.x(QList<Qjava.lang.Number;>;)
CodeSelectRequestor: Could not proceed due to null declaring type for org.codehaus.groovy.ast.expr.ConstantExpression@e8fc6[fff]
CodeSelectRequestor: Could not proceed due to null declaring type for org.codehaus.groovy.ast.expr.ConstantExpression@e8fca[fff]
CodeSelectRequestor: Could not proceed due to null declaring type for org.codehaus.groovy.ast.expr.ConstantExpression@e8fca[fff]
Waiting for: Java indexing... 3 files to index (/Project)
Waiting for: Java indexing... 22 files to index (/Project)
Waiting for: Java indexing... 4 files to index (/opt/bamboo-home/xml-data/build-dir/GRECLIPSE-E413-JOB1/ide-test/org.codehaus.groovy.alltests/target/work/plugins/org.eclipse.jdt.groovy.core.tests.builder_3.6.0.v201911081924-e1909/lib/binGroovySearch.jar)
Waiting for: Java indexing... 22 files to index (/Project)
Waiting for: Java indexing... 22 files to index (/Project)
Waiting for: Java indexing... 22 files to index (/Project)
Waiting for: Java indexing... 22 files to index (/Project)
Waiting for: Java indexing... 21 files to index (/Project)
Waiting for: Java indexing... 21 files to index (/Project)
Waiting for: Java indexing... 21 files to index (/Project)
Waiting for: Flushing content description cache.
Waiting for: Java indexing... 21 files to index (/Project)