Build: #114 failed

Job: Default Job failed

Stages & jobs

  1. Default Stage

Job result summary

Completed
Duration
91 minutes
Agent
bamboo-16.af.pivotal.io
Revision
a78f3dbd98c5f138f80c80f984619deb44423de9 a78f3dbd98c5f138f80c80f984619deb44423de9
Total tests
6145
Failing since
#101 (Code changes detected – )
Fixed in
#118 (Code changes detected)

Tests

  • 6,145 tests in total
  • 5 tests failed
  • 5 failures are new
  • 6 tests were fixed
  • 121 tests were quarantined / skipped
  • 87 minutes taken in total.
New test failures 5
Status Test Duration
Collapse Failed BasicGroovyBuildTests testSlow_GRE870 History
< 1 sec
org.junit.ComparisonFailure: unexpected recompiled units. lenExpected=2 lenActual=1 expected:<{Foo[,Test1]}> but was:<{Foo[]}>
	at org.eclipse.jdt.core.groovy.tests.builder.BasicGroovyBuildTests.testSlow_GRE870(BasicGroovyBuildTests.java:1451)
Collapse Failed BasicGroovyBuildTests testTaskMarkerInMultiLineInsideClass History
< 1 sec
java.lang.AssertionError: missing expected problem: Problem : todonothing * [ resource : </Project/src/p/A.groovy> range : <40,54> category : <-1> severity : <2>]
	at org.eclipse.jdt.core.groovy.tests.builder.BasicGroovyBuildTests.testTaskMarkerInMultiLineInsideClass(BasicGroovyBuildTests.java:2459)
Collapse Failed ClosureInferencingTests testClosure25 History
< 1 sec
java.lang.AssertionError: Expected type not found.
Expected: java.lang.Void
Found: java.lang.Long
Declaring type: Search
ASTNode: org.codehaus.groovy.ast.expr.VariableExpression@f0bc7[variable: time]
Confidence: INFERRED

java.lang.AssertionError: 
(8 more lines...)
Collapse Failed DGMInferencingTests testDGM13 History
< 1 sec
java.lang.AssertionError: Expected type not found.
Expected: java.lang.Integer
Found: java.lang.Object
Declaring type: Search
ASTNode: org.codehaus.groovy.ast.expr.VariableExpression@f69ba[variable: value]
Confidence: INFERRED

java.lang.AssertionError: 
(9 more lines...)
Collapse Failed DGMInferencingTests testDGM35 History
< 1 sec
java.lang.AssertionError: Expected type not found.
Expected: java.io.InputStream
Found: java.lang.Object
Declaring type: groovy.lang.Closure<V extends java.lang.Object>
ASTNode: org.codehaus.groovy.ast.expr.VariableExpression@f1349[variable: it]
Confidence: INFERRED

java.lang.AssertionError: 
(9 more lines...)
Fixed tests 6
Status Test Failing since Duration
Successful GroovyContentTypeTests testGroovyThenJavaProject History
Failing since build #113 (Code changes detected) < 1 sec
Successful ArrayInferencingTests testArray6 History
Failing since build #113 (Code changes detected) < 1 sec
Successful ArrayInferencingTests testArrayProperty5 History
Failing since build #113 (Code changes detected) < 1 sec
Successful BinarySearchTests testClassDecl2 History
Failing since build #113 (Code changes detected) 1 sec
Successful ConstructorReferenceSearchTests testConstructorReferences1 History
Failing since build #113 (Code changes detected) < 1 sec
Successful ConstructorReferenceSearchTests testConstructorReferences7 History
Failing since build #113 (Code changes detected) < 1 sec

Error summary

The build generated some errors. See the full build log for more details.

Nov 08, 2019 9:18:49 PM org.apache.http.impl.execchain.RetryExec execute
INFO: I/O exception (org.apache.http.NoHttpResponseException) caught when processing request to {s}->https://download.eclipse.org:443: The target server failed to respond
Nov 08, 2019 9:18:49 PM org.apache.http.impl.execchain.RetryExec execute
INFO: Retrying request to {s}->https://download.eclipse.org:443
SWT SessionManagerDBus: Failed to connect to org.gnome.SessionManager: Failed to execute child process “dbus-launch” (No such file or directory)
SWT SessionManagerDBus: Failed to connect to org.xfce.SessionManager: Failed to execute child process “dbus-launch” (No such file or directory)
TypeInferencingVisitorWithRequestor.findMethodNode: no match found for Main.main([Qjava.lang.String;)
TypeInferencingVisitorWithRequestor.findMethodNode: no match found for Main.main([Qjava.lang.String;)
CodeSelectRequestor: Could not proceed due to null declaring type for org.codehaus.groovy.ast.expr.BinaryExpression@ecbea[org.codehaus.groovy.ast.expr.VariableExpression@ecbe3[variable: it]("in" at 1:20:  "in" )org.codehaus.groovy.ast.expr.ListExpression@ee270[]]
CodeSelectRequestor: Could not proceed due to null declaring type for org.codehaus.groovy.ast.expr.RangeExpression@ebcdd
CodeSelectRequestor: Could not proceed due to null declaring type for org.codehaus.groovy.ast.expr.RangeExpression@ebcde
TypeInferencingVisitorWithRequestor.findMethodNode: no match found for Type.x(QList<Qjava.util.Date;>;)
TypeInferencingVisitorWithRequestor.findMethodNode: no match found for Type.x(QList<Qjava.lang.Number;>;)
TypeInferencingVisitorWithRequestor.findMethodNode: no match found for Type.x(QList<Qjava.lang.Number;>;)
TypeInferencingVisitorWithRequestor.findMethodNode: no match found for Type.x(QList<Qjava.util.Date;>;)
TypeInferencingVisitorWithRequestor.findMethodNode: no match found for Type.x(QList<Qjava.lang.Number;>;)
TypeInferencingVisitorWithRequestor.findMethodNode: no match found for Type.x(QList<Qjava.lang.Number;>;)
CodeSelectRequestor: Could not proceed due to null declaring type for org.codehaus.groovy.ast.expr.ConstantExpression@e8fc6[fff]
CodeSelectRequestor: Could not proceed due to null declaring type for org.codehaus.groovy.ast.expr.ConstantExpression@e8fca[fff]
CodeSelectRequestor: Could not proceed due to null declaring type for org.codehaus.groovy.ast.expr.ConstantExpression@e8fca[fff]
Waiting for: Java indexing... 17 files to index (/opt/jdk8u232-b09/jre/lib/rt.jar)
Waiting for: Java indexing... 22 files to index (/Project)
Waiting for: Java indexing... 22 files to index (/Project)
Waiting for: Java indexing... 22 files to index (/Project)
Waiting for: Java indexing... 22 files to index (/Project)
Waiting for: Java indexing... 22 files to index (/Project)
Waiting for: Java indexing... 22 files to index (/Project)
Waiting for: Java indexing... 21 files to index (/Project)
Waiting for: Java indexing... 21 files to index (/Project)
Waiting for: Java indexing... 21 files to index (/Project)
Waiting for: Flushing content description cache.
Waiting for: Java indexing... 3 files to index (/Project)