Build: #115 failed

Job: Default Job failed

Stages & jobs

  1. Default Stage

Job result summary

Completed
Duration
91 minutes
Agent
bamboo-17.af.pivotal.io
Revision
3debe96df6d3c8a2b6c6b76f218293f5d3602e1f 3debe96df6d3c8a2b6c6b76f218293f5d3602e1f
Total tests
6149
Failing since
#101 (Code changes detected – )
Fixed in
#118 (Code changes detected)

Tests

  • 6,149 tests in total
  • 5 tests failed
  • 5 failures are new
  • 5 tests were fixed
  • 121 tests were quarantined / skipped
  • 86 minutes taken in total.
New test failures 5
Status Test Duration
Collapse Failed BuildAccessRulesTests testAccessForImplementsGenerics History
< 1 sec
junit.framework.ComparisonFailure: 
----------- Expected ------------
Problem : Access restriction: The type 'BeanInfo' is not API (restriction on required library '##') [ resource : </Project/src/Foo.groovy> range : <55,63> category : <150> severity : <2>]

------------ but was ------------

--------- Difference is ----------
 expected:<[Problem : Access restriction: The type 'BeanInfo' is not API (restriction on required library '##') [ resource : </Project/src/Foo.groovy> range : <55,63> category : <150> severity : <2>]
(13 more lines...)
Collapse Failed ConstructorReferenceSearchTests testConstructorReferences11 History
< 1 sec
java.lang.AssertionError: expected:<2> but was:<0>
	at org.eclipse.jdt.core.groovy.tests.search.ConstructorReferenceSearchTests.testConstructorReferences11(ConstructorReferenceSearchTests.java:276)
Collapse Failed ConstructorReferenceSearchTests testConstructorReferences5 History
< 1 sec
java.lang.AssertionError: expected:<1> but was:<0>
	at org.eclipse.jdt.core.groovy.tests.search.ConstructorReferenceSearchTests.testConstructorReferences5(ConstructorReferenceSearchTests.java:162)
Collapse Failed MethodReferenceSearchTests testGenericsMethodReferenceSearch History
< 1 sec
java.lang.AssertionError: expected:<0> but was:<1>
	at org.eclipse.jdt.core.groovy.tests.search.MethodReferenceSearchTests.testGenericsMethodReferenceSearch(MethodReferenceSearchTests.java:711)
Collapse Failed TypeReferenceSearchTests testFindClassDeclarationWithPattern History
< 1 sec
java.lang.AssertionError: Number of results found expected:<2> but was:<0>
	at org.eclipse.jdt.core.groovy.tests.search.TypeReferenceSearchTests.testFindClassDeclarationWithPattern(TypeReferenceSearchTests.java:220)
Fixed tests 5
Status Test Failing since Duration
Successful BasicGroovyBuildTests testSlow_GRE870 History
Failing since build #114 (Code changes detected) < 1 sec
Successful BasicGroovyBuildTests testTaskMarkerInMultiLineInsideClass History
Failing since build #114 (Code changes detected) < 1 sec
Successful ClosureInferencingTests testClosure25 History
Failing since build #114 (Code changes detected) < 1 sec
Successful DGMInferencingTests testDGM13 History
Failing since build #114 (Code changes detected) < 1 sec
Successful DGMInferencingTests testDGM35 History
Failing since build #114 (Code changes detected) < 1 sec

Error summary

The build generated some errors. See the full build log for more details.

Nov 09, 2019 8:54:48 PM org.apache.http.impl.execchain.RetryExec execute
INFO: I/O exception (org.apache.http.NoHttpResponseException) caught when processing request to {s}->https://download.eclipse.org:443: The target server failed to respond
Nov 09, 2019 8:54:48 PM org.apache.http.impl.execchain.RetryExec execute
INFO: Retrying request to {s}->https://download.eclipse.org:443
Nov 09, 2019 8:55:05 PM org.apache.http.impl.execchain.RetryExec execute
INFO: I/O exception (org.apache.http.NoHttpResponseException) caught when processing request to {s}->https://download.eclipse.org:443: The target server failed to respond
Nov 09, 2019 8:55:05 PM org.apache.http.impl.execchain.RetryExec execute
INFO: Retrying request to {s}->https://download.eclipse.org:443
Nov 09, 2019 8:55:08 PM org.apache.http.impl.execchain.RetryExec execute
INFO: I/O exception (org.apache.http.NoHttpResponseException) caught when processing request to {s}->https://download.eclipse.org:443: The target server failed to respond
Nov 09, 2019 8:55:08 PM org.apache.http.impl.execchain.RetryExec execute
INFO: Retrying request to {s}->https://download.eclipse.org:443
Nov 09, 2019 8:55:12 PM org.apache.http.impl.execchain.RetryExec execute
INFO: I/O exception (org.apache.http.NoHttpResponseException) caught when processing request to {s}->https://download.eclipse.org:443: The target server failed to respond
Nov 09, 2019 8:55:12 PM org.apache.http.impl.execchain.RetryExec execute
INFO: Retrying request to {s}->https://download.eclipse.org:443
Nov 09, 2019 8:55:22 PM org.apache.http.impl.execchain.RetryExec execute
INFO: I/O exception (org.apache.http.NoHttpResponseException) caught when processing request to {s}->https://download.eclipse.org:443: The target server failed to respond
Nov 09, 2019 8:55:22 PM org.apache.http.impl.execchain.RetryExec execute
INFO: Retrying request to {s}->https://download.eclipse.org:443
Nov 09, 2019 8:55:41 PM org.apache.http.impl.execchain.RetryExec execute
INFO: I/O exception (org.apache.http.NoHttpResponseException) caught when processing request to {s}->https://download.eclipse.org:443: The target server failed to respond
Nov 09, 2019 8:55:41 PM org.apache.http.impl.execchain.RetryExec execute
INFO: Retrying request to {s}->https://download.eclipse.org:443
Nov 09, 2019 8:57:04 PM org.apache.http.impl.execchain.RetryExec execute
INFO: I/O exception (org.apache.http.NoHttpResponseException) caught when processing request to {s}->https://download.eclipse.org:443: The target server failed to respond
Nov 09, 2019 8:57:04 PM org.apache.http.impl.execchain.RetryExec execute
INFO: Retrying request to {s}->https://download.eclipse.org:443
SWT SessionManagerDBus: Failed to connect to org.gnome.SessionManager: Failed to execute child process “dbus-launch” (No such file or directory)
SWT SessionManagerDBus: Failed to connect to org.xfce.SessionManager: Failed to execute child process “dbus-launch” (No such file or directory)
TypeInferencingVisitorWithRequestor.findMethodNode: no match found for Main.main([Qjava.lang.String;)
TypeInferencingVisitorWithRequestor.findMethodNode: no match found for Main.main([Qjava.lang.String;)
CodeSelectRequestor: Could not proceed due to null declaring type for org.codehaus.groovy.ast.expr.BinaryExpression@ecbea[org.codehaus.groovy.ast.expr.VariableExpression@ecbe3[variable: it]("in" at 1:20:  "in" )org.codehaus.groovy.ast.expr.ListExpression@ee270[]]
CodeSelectRequestor: Could not proceed due to null declaring type for org.codehaus.groovy.ast.expr.RangeExpression@ebcdd
CodeSelectRequestor: Could not proceed due to null declaring type for org.codehaus.groovy.ast.expr.RangeExpression@ebcde
TypeInferencingVisitorWithRequestor.findMethodNode: no match found for Type.x(QList<Qjava.util.Date;>;)
TypeInferencingVisitorWithRequestor.findMethodNode: no match found for Type.x(QList<Qjava.lang.Number;>;)
TypeInferencingVisitorWithRequestor.findMethodNode: no match found for Type.x(QList<Qjava.lang.Number;>;)
TypeInferencingVisitorWithRequestor.findMethodNode: no match found for Type.x(QList<Qjava.util.Date;>;)
TypeInferencingVisitorWithRequestor.findMethodNode: no match found for Type.x(QList<Qjava.lang.Number;>;)
TypeInferencingVisitorWithRequestor.findMethodNode: no match found for Type.x(QList<Qjava.lang.Number;>;)
CodeSelectRequestor: Could not proceed due to null declaring type for org.codehaus.groovy.ast.expr.ConstantExpression@e8fc6[fff]
CodeSelectRequestor: Could not proceed due to null declaring type for org.codehaus.groovy.ast.expr.ConstantExpression@e8fca[fff]
CodeSelectRequestor: Could not proceed due to null declaring type for org.codehaus.groovy.ast.expr.ConstantExpression@e8fca[fff]
Waiting for: Java indexing... 18 files to index (/opt/jdk8u232-b09/jre/lib/rt.jar)
Waiting for: Java indexing... 22 files to index (/Project)
Waiting for: Java indexing... 22 files to index (/Project)
Waiting for: Java indexing... 22 files to index (/Project)
Waiting for: Java indexing... 22 files to index (/Project)
Waiting for: Java indexing... 22 files to index (/Project)
Waiting for: Java indexing... 22 files to index (/Project)
Waiting for: Java indexing... 21 files to index (/Project)
Waiting for: Java indexing... 19 files to index (/opt/jdk8u232-b09/jre/lib/resources.jar)
Waiting for: Java indexing... 21 files to index (/Project)
Waiting for: Java indexing... 3 files to index (/Project)