Build: #123 failed

Job: Default Job failed

Stages & jobs

  1. Default Stage

Job result summary

Completed
Duration
91 minutes
Agent
bamboo-18.af.pivotal.io
Revision
a0e51108a74483c4cb7848f9e43fe6a41e430a3b a0e51108a74483c4cb7848f9e43fe6a41e430a3b
Total tests
6156
Failing since
#119 (Code changes detected – )
Fixed in
#126 (Code changes detected)

Tests

  • 6,156 tests in total
  • 3 tests failed
  • 3 failures are new
  • 19 tests were fixed
  • 119 tests were quarantined / skipped
  • 86 minutes taken in total.
New test failures 3
Status Test Duration
Collapse Failed BinarySearchTests testFieldDecl2 History
1 sec
java.lang.AssertionError: Expecting 2 matches, but found 0

java.lang.AssertionError: 
Expecting 2 matches, but found 0

	at org.eclipse.jdt.core.groovy.tests.search.BinarySearchTests.assertMatches(BinarySearchTests.java:139)
	at org.eclipse.jdt.core.groovy.tests.search.BinarySearchTests.testFieldDecl2(BinarySearchTests.java:190)
Collapse Failed BinarySearchTests testMethodRefInInitializer History
1 sec
java.lang.AssertionError: Expecting 2 matches, but found 0

java.lang.AssertionError: 
Expecting 2 matches, but found 0

	at org.eclipse.jdt.core.groovy.tests.search.BinarySearchTests.assertMatches(BinarySearchTests.java:139)
	at org.eclipse.jdt.core.groovy.tests.search.BinarySearchTests.testMethodRefInInitializer(BinarySearchTests.java:217)
Collapse Failed MethodReferenceSearchTests testExplicitPropertySetterSearch1 History
< 1 sec
java.lang.AssertionError: expected:<5> but was:<0>
	at org.eclipse.jdt.core.groovy.tests.search.MethodReferenceSearchTests.testExplicitPropertySetterSearch1(MethodReferenceSearchTests.java:623)
Fixed tests 19
Status Test Failing since Duration
Successful RenameFieldTests test10 History
Failing since build #122 (Code changes detected) 5 secs
Successful RenameFieldTests test11 History
Failing since build #122 (Code changes detected) 1 sec
Successful RenameFieldTests test13 History
Failing since build #122 (Code changes detected) 1 sec
Successful RenameFieldTests test14 History
Failing since build #122 (Code changes detected) 1 sec
Successful RenameFieldTests test2 History
Failing since build #122 (Code changes detected) 1 sec
Successful RenameFieldTests test3 History
Failing since build #122 (Code changes detected) 1 sec
Successful RenameFieldTests test4 History
Failing since build #122 (Code changes detected) 1 sec
Successful RenameFieldTests test5 History
Failing since build #122 (Code changes detected) 1 sec
Successful RenameFieldTests test6 History
Failing since build #122 (Code changes detected) 1 sec
Successful RenameFieldTests test7 History
Failing since build #122 (Code changes detected) 1 sec
Successful RenameFieldTests test8 History
Failing since build #122 (Code changes detected) 1 sec
Successful RenameFieldTests test9 History
Failing since build #122 (Code changes detected) 1 sec
Successful RenameFieldTests testInitializer1 History
Failing since build #122 (Code changes detected) 1 sec
Successful RenameFieldTests testInitializer2 History
Failing since build #122 (Code changes detected) 1 sec
Successful RenameFieldTests testInitializer3 History
Failing since build #122 (Code changes detected) 1 sec
Successful RenameFieldTests testScript1 History
Failing since build #122 (Code changes detected) 1 sec
Successful RenameFieldTests testScript2 History
Failing since build #122 (Code changes detected) 1 sec
Successful BasicGroovyBuildTests testBuildGroovy2 History
Failing since build #122 (Code changes detected) < 1 sec
Successful BasicGroovyBuildTests testBuildGroovyHelloWorld History
Failing since build #122 (Code changes detected) < 1 sec

Error summary

The build generated some errors. See the full build log for more details.

Nov 23, 2019 5:01:02 PM org.apache.http.impl.execchain.RetryExec execute
INFO: I/O exception (org.apache.http.NoHttpResponseException) caught when processing request to {s}->https://download.eclipse.org:443: The target server failed to respond
Nov 23, 2019 5:01:02 PM org.apache.http.impl.execchain.RetryExec execute
INFO: Retrying request to {s}->https://download.eclipse.org:443
SWT SessionManagerDBus: Failed to connect to org.gnome.SessionManager: Failed to execute child process “dbus-launch” (No such file or directory)
SWT SessionManagerDBus: Failed to connect to org.xfce.SessionManager: Failed to execute child process “dbus-launch” (No such file or directory)
TypeInferencingVisitorWithRequestor.findMethodNode: no match found for Main.main([Qjava.lang.String;)
TypeInferencingVisitorWithRequestor.findMethodNode: no match found for Main.main([Qjava.lang.String;)
CodeSelectRequestor: Could not proceed due to null declaring type for org.codehaus.groovy.ast.expr.BinaryExpression@ecbea[org.codehaus.groovy.ast.expr.VariableExpression@ecbe3[variable: it]("in" at 1:20:  "in" )org.codehaus.groovy.ast.expr.ListExpression@ee270[]]
CodeSelectRequestor: Could not proceed due to null declaring type for org.codehaus.groovy.ast.expr.RangeExpression@ebcdd
CodeSelectRequestor: Could not proceed due to null declaring type for org.codehaus.groovy.ast.expr.RangeExpression@ebcde
TypeInferencingVisitorWithRequestor.findMethodNode: no match found for Type.x(QList<Qjava.util.Date;>;)
TypeInferencingVisitorWithRequestor.findMethodNode: no match found for Type.x(QList<Qjava.lang.Number;>;)
TypeInferencingVisitorWithRequestor.findMethodNode: no match found for Type.x(QList<Qjava.lang.Number;>;)
TypeInferencingVisitorWithRequestor.findMethodNode: no match found for Type.x(QList<Qjava.util.Date;>;)
TypeInferencingVisitorWithRequestor.findMethodNode: no match found for Type.x(QList<Qjava.lang.Number;>;)
TypeInferencingVisitorWithRequestor.findMethodNode: no match found for Type.x(QList<Qjava.lang.Number;>;)
CodeSelectRequestor: Could not proceed due to null declaring type for org.codehaus.groovy.ast.expr.ConstantExpression@e8fc6[fff]
CodeSelectRequestor: Could not proceed due to null declaring type for org.codehaus.groovy.ast.expr.ConstantExpression@e8fca[fff]
CodeSelectRequestor: Could not proceed due to null declaring type for org.codehaus.groovy.ast.expr.ConstantExpression@e8fca[fff]
Waiting for: Java indexing... 22 files to index (/Project)
Waiting for: Java indexing... 22 files to index (/Project)
Waiting for: Java indexing... 22 files to index (/Project)
Waiting for: Java indexing... 22 files to index (/Project)
Waiting for: Java indexing... 22 files to index (/Project)
Waiting for: Java indexing... 22 files to index (/Project)
Waiting for: Java indexing... 22 files to index (/Project)
Waiting for: Java indexing... 21 files to index (/Project)
Waiting for: Java indexing... 21 files to index (/Project)
Waiting for: Java indexing... 21 files to index (/Project)
Waiting for: Flushing content description cache.
Waiting for: Java indexing... 3 files to index (/Project)
Waiting for: Flushing content description cache.