Build: #128 failed

Job: Default Job failed

Stages & jobs

  1. Default Stage

Job result summary

Completed
Duration
90 minutes
Agent
bamboo-21.af.pivotal.io
Revision
32535f158979dd95f250cf3aca5e0f367692a5ee 32535f158979dd95f250cf3aca5e0f367692a5ee
Total tests
6166
Failing since
#127 (Code changes detected – )
Fixed in
#131 (Code changes detected)

Tests

  • 6,166 tests in total
  • 2 tests failed
  • 2 failures are new
  • 5 tests were fixed
  • 119 tests were quarantined / skipped
  • 86 minutes taken in total.
New test failures 2
Status Test Duration
Collapse Failed DGMInferencingTests testDGSMDeclaring5 History
< 1 sec
java.lang.AssertionError: Expected declaring type not found.
 Expected: org.codehaus.groovy.runtime.DefaultGroovyStaticMethods
 Found type: java.lang.String
 Found declaring type: java.util.regex.Matcher
 ASTNode: org.codehaus.groovy.ast.expr.ConstantExpression@ee9ff[getLastMatcher]
java.lang.AssertionError: 
Expected declaring type not found.
	Expected: org.codehaus.groovy.runtime.DefaultGroovyStaticMethods
(5 more lines...)
Collapse Failed InferencingTests testNothingIsUnknownWithCategories History
< 1 sec
java.lang.AssertionError: Should not have found any AST nodes with unknown confidence, but found:
[org.codehaus.groovy.ast.expr.ConstantExpression@f96d0[use], org.codehaus.groovy.ast.expr.ConstantExpression@101a5a[println], org.codehaus.groovy.ast.expr.ConstantExpression@108ed8[println], org.codehaus.groovy.ast.expr.ConstantExpression@156326[use]]
java.lang.AssertionError: 
Should not have found any AST nodes with unknown confidence, but found:
[org.codehaus.groovy.ast.expr.ConstantExpression@f96d0[use], org.codehaus.groovy.ast.expr.ConstantExpression@101a5a[println], org.codehaus.groovy.ast.expr.ConstantExpression@108ed8[println], org.codehaus.groovy.ast.expr.ConstantExpression@156326[use]]
	at org.eclipse.jdt.core.groovy.tests.search.InferencingTests.assertNoUnknowns(InferencingTests.java:44)
	at org.eclipse.jdt.core.groovy.tests.search.InferencingTests.testNothingIsUnknownWithCategories(InferencingTests.java:2351)
Fixed tests 5
Status Test Failing since Duration
Successful ArrayInferencingTests testArrayProperty10 History
Failing since build #127 (Code changes detected) < 1 sec
Successful BinarySearchTests testFieldDecl2 History
Failing since build #127 (Code changes detected) 1 sec
Successful BinarySearchTests testMethodRefInInitializer History
Failing since build #127 (Code changes detected) 1 sec
Successful ClosureInferencingTests testClosureReturnType4 History
Failing since build #127 (Code changes detected) < 1 sec
Successful ConstructorReferenceSearchTests testConstructorReferences1 History
Failing since build #127 (Code changes detected) < 1 sec

Error summary

The build generated some errors. See the full build log for more details.

Nov 27, 2019 3:53:43 PM org.apache.http.impl.execchain.RetryExec execute
INFO: I/O exception (org.apache.http.NoHttpResponseException) caught when processing request to {s}->https://download.eclipse.org:443: The target server failed to respond
Nov 27, 2019 3:53:43 PM org.apache.http.impl.execchain.RetryExec execute
INFO: Retrying request to {s}->https://download.eclipse.org:443
SWT SessionManagerDBus: Failed to connect to org.gnome.SessionManager: Failed to execute child process “dbus-launch” (No such file or directory)
SWT SessionManagerDBus: Failed to connect to org.xfce.SessionManager: Failed to execute child process “dbus-launch” (No such file or directory)
TypeInferencingVisitorWithRequestor.findMethodNode: no match found for Main.main([Qjava.lang.String;)
TypeInferencingVisitorWithRequestor.findMethodNode: no match found for Main.main([Qjava.lang.String;)
CodeSelectRequestor: Could not proceed due to null declaring type for org.codehaus.groovy.ast.expr.BinaryExpression@ecbea[org.codehaus.groovy.ast.expr.VariableExpression@ecbe3[variable: it]("in" at 1:20:  "in" )org.codehaus.groovy.ast.expr.ListExpression@ee270[]]
CodeSelectRequestor: Could not proceed due to null declaring type for org.codehaus.groovy.ast.expr.RangeExpression@ebcdd
CodeSelectRequestor: Could not proceed due to null declaring type for org.codehaus.groovy.ast.expr.RangeExpression@ebcde
TypeInferencingVisitorWithRequestor.findMethodNode: no match found for Type.x(QList<Qjava.util.Date;>;)
TypeInferencingVisitorWithRequestor.findMethodNode: no match found for Type.x(QList<Qjava.lang.Number;>;)
TypeInferencingVisitorWithRequestor.findMethodNode: no match found for Type.x(QList<Qjava.lang.Number;>;)
TypeInferencingVisitorWithRequestor.findMethodNode: no match found for Type.x(QList<Qjava.util.Date;>;)
TypeInferencingVisitorWithRequestor.findMethodNode: no match found for Type.x(QList<Qjava.lang.Number;>;)
CodeSelectRequestor: Could not proceed due to null declaring type for org.codehaus.groovy.ast.expr.ConstantExpression@e8fc6[fff]
CodeSelectRequestor: Could not proceed due to null declaring type for org.codehaus.groovy.ast.expr.ConstantExpression@e8fca[fff]
CodeSelectRequestor: Could not proceed due to null declaring type for org.codehaus.groovy.ast.expr.ConstantExpression@e8fca[fff]
Waiting for: Java indexing... 3 files to index (/Project)
Waiting for: Java indexing... 22 files to index (/Project)
Waiting for: Java indexing... 22 files to index (/Project)
Waiting for: Java indexing... 22 files to index (/Project)
Waiting for: Java indexing... 22 files to index (/Project)
Waiting for: Java indexing... 22 files to index (/Project)
Waiting for: Java indexing... 22 files to index (/Project)
Waiting for: Java indexing... 18 files to index (/opt/jdk8u232-b09/jre/lib/resources.jar)
Waiting for: Java indexing... 5 files to index (/Project)
Waiting for: Flushing content description cache.
Waiting for: Java indexing... 21 files to index (/Project)
Waiting for: Java indexing... 17 files to index (/opt/jdk8u232-b09/jre/lib/rt.jar)