Build: #132 failed

Job: Default Job failed

Stages & jobs

  1. Default Stage

Job result summary

Completed
Duration
92 minutes
Agent
bamboo-17.af.pivotal.io
Revision
273a92acfb44ab3c2af50cded7c4d2b306ad057b 273a92acfb44ab3c2af50cded7c4d2b306ad057b
Total tests
6181
Fixed in
#134 (Code changes detected)

Tests

  • 6,181 tests in total
  • 8 tests failed
  • 8 failures are new
  • 119 tests were quarantined / skipped
  • 87 minutes taken in total.
New test failures 8
Status Test Duration
Collapse Failed CodeSelectImportsTests testCodeSelectOnImportPackage3 History
1 sec
java.lang.AssertionError: Should have found a selection expected:<1> but was:<0>
	at org.codehaus.groovy.eclipse.codebrowsing.tests.CodeSelectImportsTests.testCodeSelectOnImportPackage3(CodeSelectImportsTests.groovy:113)
Collapse Failed MainMethodFinderTests testMainMethodFinder1 History
5 secs
java.lang.AssertionError: Wrong number of main methods found in: []. Expression: (types.length == expected.length)
	at org.codehaus.groovy.eclipse.junit.test.MainMethodFinderTests.expectTypesWithMain(MainMethodFinderTests.groovy:37)
	at org.codehaus.groovy.eclipse.junit.test.MainMethodFinderTests.testMainMethodFinder1(MainMethodFinderTests.groovy:51)
Collapse Failed MainMethodFinderTests testMainMethodFinder6 History
2 secs
java.lang.AssertionError: Wrong number of main methods found in: []. Expression: (types.length == expected.length)
	at org.codehaus.groovy.eclipse.junit.test.MainMethodFinderTests.expectTypesWithMain(MainMethodFinderTests.groovy:37)
	at org.codehaus.groovy.eclipse.junit.test.MainMethodFinderTests.testMainMethodFinder6(MainMethodFinderTests.groovy:104)
Collapse Failed MainMethodFinderTests testMainMethodFinder7 History
2 secs
java.lang.AssertionError: Wrong number of main methods found in: []. Expression: (types.length == expected.length)
	at org.codehaus.groovy.eclipse.junit.test.MainMethodFinderTests.expectTypesWithMain(MainMethodFinderTests.groovy:37)
	at org.codehaus.groovy.eclipse.junit.test.MainMethodFinderTests.testMainMethodFinder7(MainMethodFinderTests.groovy:117)
Collapse Failed MainMethodFinderTests testMainMethodFinder8 History
1 sec
java.lang.AssertionError: Wrong number of main methods found in: []. Expression: (types.length == expected.length)
	at org.codehaus.groovy.eclipse.junit.test.MainMethodFinderTests.expectTypesWithMain(MainMethodFinderTests.groovy:37)
	at org.codehaus.groovy.eclipse.junit.test.MainMethodFinderTests.testMainMethodFinder8(MainMethodFinderTests.groovy:133)
Collapse Failed ArrayInferencingTests testArrayProperty6 History
< 1 sec
java.lang.AssertionError: Expected type not found.
Expected: XX
Found: java.lang.String
Declaring type: java.lang.String
ASTNode: org.codehaus.groovy.ast.expr.ConstantExpression@ef177[yy]
Confidence: UNKNOWN

java.lang.AssertionError: 
(8 more lines...)
Collapse Failed BinarySearchTests testFieldRefInInitializer History
1 sec
java.lang.AssertionError: Expecting 1 matches, but found 0

java.lang.AssertionError: 
Expecting 1 matches, but found 0

	at org.eclipse.jdt.core.groovy.tests.search.BinarySearchTests.assertMatches(BinarySearchTests.java:139)
	at org.eclipse.jdt.core.groovy.tests.search.BinarySearchTests.testFieldRefInInitializer(BinarySearchTests.java:208)
Collapse Failed ConstructorReferenceSearchTests testConstructorReferences12a History
< 1 sec
java.lang.AssertionError: expected:<3> but was:<0>
	at org.eclipse.jdt.core.groovy.tests.search.ConstructorReferenceSearchTests.testConstructorReferences12a(ConstructorReferenceSearchTests.java:332)

Error summary

The build generated some errors. See the full build log for more details.

Dec 02, 2019 9:33:56 AM org.apache.http.impl.execchain.RetryExec execute
INFO: I/O exception (org.apache.http.NoHttpResponseException) caught when processing request to {s}->https://download.eclipse.org:443: The target server failed to respond
Dec 02, 2019 9:33:56 AM org.apache.http.impl.execchain.RetryExec execute
INFO: Retrying request to {s}->https://download.eclipse.org:443
SWT SessionManagerDBus: Failed to connect to org.gnome.SessionManager: Failed to execute child process “dbus-launch” (No such file or directory)
SWT SessionManagerDBus: Failed to connect to org.xfce.SessionManager: Failed to execute child process “dbus-launch” (No such file or directory)
TypeInferencingVisitorWithRequestor.findMethodNode: no match found for Main.main([Qjava.lang.String;)
TypeInferencingVisitorWithRequestor.findMethodNode: no match found for Main.main([Qjava.lang.String;)
CodeSelectRequestor: Could not proceed due to null declaring type for org.codehaus.groovy.ast.expr.BinaryExpression@ecbea[org.codehaus.groovy.ast.expr.VariableExpression@ecbe3[variable: it]("in" at 1:20:  "in" )org.codehaus.groovy.ast.expr.ListExpression@ee270[]]
CodeSelectRequestor: Could not proceed due to null declaring type for org.codehaus.groovy.ast.expr.RangeExpression@ebcdd
CodeSelectRequestor: Could not proceed due to null declaring type for org.codehaus.groovy.ast.expr.RangeExpression@ebcde
TypeInferencingVisitorWithRequestor.findMethodNode: no match found for Type.x(QList<Qjava.util.Date;>;)
TypeInferencingVisitorWithRequestor.findMethodNode: no match found for Type.x(QList<Qjava.lang.Number;>;)
TypeInferencingVisitorWithRequestor.findMethodNode: no match found for Type.x(QList<Qjava.lang.Number;>;)
TypeInferencingVisitorWithRequestor.findMethodNode: no match found for Type.x(QList<Qjava.util.Date;>;)
TypeInferencingVisitorWithRequestor.findMethodNode: no match found for Type.x(QList<Qjava.lang.Number;>;)
TypeInferencingVisitorWithRequestor.findMethodNode: no match found for Type.x(QList<Qjava.lang.Number;>;)
CodeSelectRequestor: Could not proceed due to null declaring type for org.codehaus.groovy.ast.expr.ConstantExpression@e8fc6[fff]
CodeSelectRequestor: Could not proceed due to null declaring type for org.codehaus.groovy.ast.expr.ConstantExpression@e8fca[fff]
CodeSelectRequestor: Could not proceed due to null declaring type for org.codehaus.groovy.ast.expr.ConstantExpression@e8fca[fff]
Waiting for: Java indexing... 22 files to index (/Project)
Waiting for: Java indexing... 22 files to index (/Project)
Waiting for: Java indexing... 22 files to index (/Project)
Waiting for: Java indexing... 22 files to index (/Project)
Waiting for: Java indexing... 22 files to index (/Project)
Waiting for: Java indexing... 22 files to index (/Project)
Waiting for: Java indexing... 21 files to index (/Project)
Waiting for: Java indexing... 21 files to index (/Project)
Waiting for: Flushing content description cache.
Waiting for: Java indexing... 21 files to index (/Project)
Waiting for: Flushing content description cache.
Waiting for: Java indexing... 16 files to index (/Project)