Build: #136 failed

Job: Default Job failed

Stages & jobs

  1. Default Stage

Job result summary

Completed
Duration
91 minutes
Agent
bamboo-16.af.pivotal.io
Revision
9a13f6a52e0f1d3be2f1922480fcf3923497bac5 9a13f6a52e0f1d3be2f1922480fcf3923497bac5
Total tests
6187
Failing since
#135 (Code changes detected – )

Tests

  • 6,187 tests in total
  • 13 tests failed
  • 13 failures are new
  • 1 test was fixed
  • 119 tests were quarantined / skipped
  • 87 minutes taken in total.
New test failures 13
Status Test Duration
Collapse Failed MoveCURefactoringTests testMoveBack History
1 sec
org.junit.ComparisonFailure: Refactoring produced unexpected results: expected:<package p2
[]
public class Groovy...> but was:<package p2
[import p1.Groovy
]
public class Groovy...>
org.junit.ComparisonFailure: 
Refactoring produced unexpected results: expected:<package p2
(7 more lines...)
Collapse Failed MoveCURefactoringTests testNonPrimaryMove History
1 sec
org.junit.ComparisonFailure: Refactoring produced unexpected results: expected:<package p2
import [NEW].Groovy
public class...> but was:<package p2
import [p1].Groovy
public class...>
org.junit.ComparisonFailure: 
Refactoring produced unexpected results: expected:<package p2
import [NEW].Groovy
(5 more lines...)
Collapse Failed MoveCURefactoringTests testNonPrimaryQualifiedMove History
1 sec
org.junit.ComparisonFailure: Refactoring produced unexpected results: expected:<...ass Groovy2 extends [NEW].Groovy { }> but was:<...ass Groovy2 extends [p1].Groovy { }>
	at org.codehaus.groovy.eclipse.refactoring.test.rename.MoveCURefactoringTests.performRefactoringAndUndo(MoveCURefactoringTests.groovy:67)
	at org.codehaus.groovy.eclipse.refactoring.test.rename.MoveCURefactoringTests.testNonPrimaryQualifiedMove(MoveCURefactoringTests.groovy:235)
Collapse Failed MoveCURefactoringTests testQualifiedMove1 History
< 1 sec
org.junit.ComparisonFailure: Refactoring produced unexpected results: expected:<...lass Groovy extends [NEW].Java { }> but was:<...lass Groovy extends [p].Java { }>
	at org.codehaus.groovy.eclipse.refactoring.test.rename.MoveCURefactoringTests.performRefactoringAndUndo(MoveCURefactoringTests.groovy:67)
	at org.codehaus.groovy.eclipse.refactoring.test.rename.MoveCURefactoringTests.testQualifiedMove1(MoveCURefactoringTests.groovy:144)
Collapse Failed MoveCURefactoringTests testQualifiedMove2 History
1 sec
org.junit.ComparisonFailure: Refactoring produced unexpected results: expected:<...ass Groovy2 extends [NEW].Groovy { }> but was:<...ass Groovy2 extends [p1].Groovy { }>
	at org.codehaus.groovy.eclipse.refactoring.test.rename.MoveCURefactoringTests.performRefactoringAndUndo(MoveCURefactoringTests.groovy:67)
	at org.codehaus.groovy.eclipse.refactoring.test.rename.MoveCURefactoringTests.testQualifiedMove2(MoveCURefactoringTests.groovy:157)
Collapse Failed MoveCURefactoringTests testQualifiedMove3 History
1 sec
org.junit.ComparisonFailure: Refactoring produced unexpected results: expected:<... g1

import static j[2.Java.*
import j2.Java

class Groovy {
  def m1() {
    Java j = new j2].Java()
(33 more lines...)
Collapse Failed MoveCURefactoringTests testSimpleMove3 History
1 sec
org.junit.ComparisonFailure: Refactoring produced unexpected results: expected:<package p;
[
import NEW.Java

]public class Groovy ...> but was:<package p;
[]public class Groovy ...>
org.junit.ComparisonFailure: 
Refactoring produced unexpected results: expected:<package p;
(7 more lines...)
Collapse Failed MoveCURefactoringTests testSimpleMove4 History
1 sec
org.junit.ComparisonFailure: Refactoring produced unexpected results: expected:<package p2
import [NEW].Groovy
public class...> but was:<package p2
import [p1].Groovy
public class...>
org.junit.ComparisonFailure: 
Refactoring produced unexpected results: expected:<package p2
import [NEW].Groovy
(5 more lines...)
Collapse Failed BuildAccessRulesTests testAccessForMethodParameter History
< 1 sec
junit.framework.ComparisonFailure: 
----------- Expected ------------
Problem : Access restriction: The type 'BeanInfo' is not API (restriction on required library '##') [ resource : </Project/src/Foo.groovy> range : <43,51> category : <150> severity : <2>]

------------ but was ------------

--------- Difference is ----------
 expected:<[Problem : Access restriction: The type 'BeanInfo' is not API (restriction on required library '##') [ resource : </Project/src/Foo.groovy> range : <43,51> category : <150> severity : <2>]
(13 more lines...)
Collapse Failed ClosureInferencingTests testWithAndClosure1 History
< 1 sec
java.lang.AssertionError: Expected type not found.
Expected: java.lang.String
Found: java.lang.Object
Declaring type: p.E
ASTNode: org.codehaus.groovy.ast.expr.VariableExpression@10ecc6[variable: foo]
Confidence: UNKNOWN

java.lang.AssertionError: 
(8 more lines...)
Collapse Failed ConstructorReferenceSearchTests testConstructorReferences12 History
< 1 sec
java.lang.AssertionError: expected:<2> but was:<0>
	at org.eclipse.jdt.core.groovy.tests.search.ConstructorReferenceSearchTests.testConstructorReferences12(ConstructorReferenceSearchTests.java:313)
Collapse Failed ConstructorReferenceSearchTests testConstructorReferences2 History
< 1 sec
java.lang.AssertionError: Incorrect number of matches; expected:<1> but was:<0>
	at org.eclipse.jdt.core.groovy.tests.search.ConstructorReferenceSearchTests.testConstructorReferences2(ConstructorReferenceSearchTests.java:96)
Collapse Failed InferencingTests testNothingIsUnknownWithCategories History
< 1 sec
java.lang.AssertionError: Should not have found any AST nodes with unknown confidence, but found:
[org.codehaus.groovy.ast.expr.ConstantExpression@f96d0[use], org.codehaus.groovy.ast.expr.ConstantExpression@101a5a[println], org.codehaus.groovy.ast.expr.ConstantExpression@108ed8[println], org.codehaus.groovy.ast.expr.ConstantExpression@156326[use]]
java.lang.AssertionError: 
Should not have found any AST nodes with unknown confidence, but found:
[org.codehaus.groovy.ast.expr.ConstantExpression@f96d0[use], org.codehaus.groovy.ast.expr.ConstantExpression@101a5a[println], org.codehaus.groovy.ast.expr.ConstantExpression@108ed8[println], org.codehaus.groovy.ast.expr.ConstantExpression@156326[use]]
	at org.eclipse.jdt.core.groovy.tests.search.InferencingTests.assertNoUnknowns(InferencingTests.java:44)
	at org.eclipse.jdt.core.groovy.tests.search.InferencingTests.testNothingIsUnknownWithCategories(InferencingTests.java:2547)
Fixed tests 1
Status Test Failing since Duration
Successful TypeReferenceSearchTests testFindClassDeclarationWithPattern History
Failing since build #135 (Code changes detected) < 1 sec

Error summary

The build generated some errors. See the full build log for more details.

Dec 04, 2019 11:04:05 PM org.apache.http.impl.execchain.RetryExec execute
INFO: I/O exception (org.apache.http.NoHttpResponseException) caught when processing request to {s}->https://download.eclipse.org:443: The target server failed to respond
Dec 04, 2019 11:04:05 PM org.apache.http.impl.execchain.RetryExec execute
INFO: Retrying request to {s}->https://download.eclipse.org:443
SWT SessionManagerDBus: Failed to connect to org.gnome.SessionManager: Failed to execute child process “dbus-launch” (No such file or directory)
SWT SessionManagerDBus: Failed to connect to org.xfce.SessionManager: Failed to execute child process “dbus-launch” (No such file or directory)
TypeInferencingVisitorWithRequestor.findMethodNode: no match found for Main.main([Qjava.lang.String;)
TypeInferencingVisitorWithRequestor.findMethodNode: no match found for Main.main([Qjava.lang.String;)
CodeSelectRequestor: Could not proceed due to null declaring type for org.codehaus.groovy.ast.expr.BinaryExpression@ecbea[org.codehaus.groovy.ast.expr.VariableExpression@ecbe3[variable: it]("in" at 1:20:  "in" )org.codehaus.groovy.ast.expr.ListExpression@ee270[]]
CodeSelectRequestor: Could not proceed due to null declaring type for org.codehaus.groovy.ast.expr.RangeExpression@ebcdd
CodeSelectRequestor: Could not proceed due to null declaring type for org.codehaus.groovy.ast.expr.RangeExpression@ebcde
TypeInferencingVisitorWithRequestor.findMethodNode: no match found for Type.x(QList<Qjava.util.Date;>;)
TypeInferencingVisitorWithRequestor.findMethodNode: no match found for Type.x(QList<Qjava.lang.Number;>;)
TypeInferencingVisitorWithRequestor.findMethodNode: no match found for Type.x(QList<Qjava.util.Date;>;)
TypeInferencingVisitorWithRequestor.findMethodNode: no match found for Type.x(QList<Qjava.lang.Number;>;)
TypeInferencingVisitorWithRequestor.findMethodNode: no match found for Type.x(QList<Qjava.lang.Number;>;)
CodeSelectRequestor: Could not proceed due to null declaring type for org.codehaus.groovy.ast.expr.ConstantExpression@e8fc6[fff]
CodeSelectRequestor: Could not proceed due to null declaring type for org.codehaus.groovy.ast.expr.ConstantExpression@e8fca[fff]
CodeSelectRequestor: Could not proceed due to null declaring type for org.codehaus.groovy.ast.expr.ConstantExpression@e8fca[fff]
Waiting for: Java indexing... 4 files to index (/Project)
Waiting for: Java indexing... 22 files to index (/Project)
Waiting for: Java indexing... 22 files to index (/Project)
Waiting for: Java indexing... 22 files to index (/Project)
Waiting for: Java indexing... 22 files to index (/Project)
Waiting for: Java indexing... 22 files to index (/Project)
Waiting for: Java indexing... 22 files to index (/Project)
Waiting for: Java indexing... 7 files to index (/Project)
Waiting for: Java indexing... 16 files to index (/opt/jdk8u232-b09/jre/lib/resources.jar)
Waiting for: Java indexing... 21 files to index (/Project)
Waiting for: Java indexing... 3 files to index (/Project)