Build: #144 failed

Job: Default Job failed

Stages & jobs

  1. Default Stage

Job result summary

Completed
Duration
90 minutes
Agent
bamboo-24.af.pivotal.io
Revision
1427ff22b237d4cfb9a5819bd42dfc9dbffc9b17 1427ff22b237d4cfb9a5819bd42dfc9dbffc9b17
Total tests
6189
Failing since
#140 (Code changes detected – )
Fixed in
#146 (Code changes detected)

Tests

  • 6,189 tests in total
  • 4 tests failed
  • 4 failures are new
  • 32 tests were fixed
  • 119 tests were quarantined / skipped
  • 86 minutes taken in total.
New test failures 4
Status Test Duration
Collapse Failed GroovyContentTypeTests testJavaThenGroovyProject History
< 1 sec
java.lang.AssertionError: L/Project/bin/p1/HelloJava.class should exist
	at org.eclipse.jdt.core.groovy.tests.model.GroovyContentTypeTests.checkJavaProject(GroovyContentTypeTests.java:152)
	at org.eclipse.jdt.core.groovy.tests.model.GroovyContentTypeTests.testJavaThenGroovyProject(GroovyContentTypeTests.java:98)
Collapse Failed DGMInferencingTests testDGM39 History
< 1 sec
java.lang.AssertionError: Expected type not found.
Expected: java.io.BufferedWriter
Found: java.lang.Object
Declaring type: groovy.lang.Closure<V extends java.lang.Object>
ASTNode: org.codehaus.groovy.ast.expr.VariableExpression@f170b[variable: it]
Confidence: INFERRED

java.lang.AssertionError: 
(9 more lines...)
Collapse Failed DGMInferencingTests testDGMClosure12 History
< 1 sec
java.lang.AssertionError: Expected type not found.
Expected: java.util.Date
Found: java.lang.Object
Declaring type: Search
ASTNode: org.codehaus.groovy.ast.expr.VariableExpression@f3ca0[variable: val]
Confidence: INFERRED

java.lang.AssertionError: 
(9 more lines...)
Collapse Failed MethodReferenceSearchTests testGenericsMethodReferenceSearch History
< 1 sec
java.lang.AssertionError: expected:<0> but was:<1>
	at org.eclipse.jdt.core.groovy.tests.search.MethodReferenceSearchTests.testGenericsMethodReferenceSearch(MethodReferenceSearchTests.java:711)
Fixed tests 32
Status Test Failing since Duration
Successful SyntheticAccessorRenamingTests testAliasedAccess History
Failing since build #143 (Code changes detected) 1 sec
Successful SyntheticAccessorRenamingTests testConstructorAccess History
Failing since build #143 (Code changes detected) 1 sec
Successful SyntheticAccessorRenamingTests testFieldAndGetterAndSetter1 History
Failing since build #143 (Code changes detected) 1 sec
Successful SyntheticAccessorRenamingTests testFieldAndGetterAndSetter2 History
Failing since build #143 (Code changes detected) 1 sec
Successful SyntheticAccessorRenamingTests testFieldAndGetterAndSetter3 History
Failing since build #143 (Code changes detected) 1 sec
Successful SyntheticAccessorRenamingTests testFieldAndGetterAndSetter4 History
Failing since build #143 (Code changes detected) < 1 sec
Successful SyntheticAccessorRenamingTests testGetterOnly History
Failing since build #143 (Code changes detected) 1 sec
Successful SyntheticAccessorRenamingTests testIsserOnly History
Failing since build #143 (Code changes detected) 1 sec
Successful SyntheticAccessorRenamingTests testJavaRename1 History
Failing since build #143 (Code changes detected) 1 sec
Successful SyntheticAccessorRenamingTests testJavaRename2 History
Failing since build #143 (Code changes detected) 1 sec
Successful SyntheticAccessorRenamingTests testMultiFileRename1 History
Failing since build #143 (Code changes detected) 1 sec
Successful SyntheticAccessorRenamingTests testMultiFileRename2 History
Failing since build #143 (Code changes detected) 1 sec
Successful SyntheticAccessorRenamingTests testMultiFileRename5 History
Failing since build #143 (Code changes detected) 1 sec
Successful SyntheticAccessorRenamingTests testMultiFileRename6 History
Failing since build #143 (Code changes detected) 1 sec
Successful SyntheticAccessorRenamingTests testMultiFileRename7 History
Failing since build #143 (Code changes detected) 1 sec
Successful SyntheticAccessorRenamingTests testSetterOnly1 History
Failing since build #143 (Code changes detected) < 1 sec
Successful SyntheticAccessorRenamingTests testSetterOnly2 History
Failing since build #143 (Code changes detected) 1 sec
Successful SyntheticAccessorRenamingTests testSetterOnly2a History
Failing since build #143 (Code changes detected) 1 sec
Successful SyntheticAccessorRenamingTests testSingleFileRename1 History
Failing since build #143 (Code changes detected) 1 sec
Successful SyntheticAccessorRenamingTests testSingleFileRename2 History
Failing since build #143 (Code changes detected) 1 sec
Successful SyntheticAccessorRenamingTests testSingleFileRename3 History
Failing since build #143 (Code changes detected) 1 sec
Successful SyntheticAccessorRenamingTests testSingleFileRename4 History
Failing since build #143 (Code changes detected) 1 sec
Successful SyntheticAccessorRenamingTests testStaticGetterOnly1 History
Failing since build #143 (Code changes detected) 1 sec
Successful SyntheticAccessorRenamingTests testStaticGetterOnly2 History
Failing since build #143 (Code changes detected) 1 sec
Successful SyntheticAccessorRenamingTests testStaticIsserOnly1 History
Failing since build #143 (Code changes detected) 1 sec
Successful SyntheticAccessorRenamingTests testStaticIsserOnly2 History
Failing since build #143 (Code changes detected) 1 sec
Successful SyntheticAccessorRenamingTests testStaticSetterOnly1 History
Failing since build #143 (Code changes detected) 1 sec
Successful SyntheticAccessorRenamingTests testStaticSetterOnly2 History
Failing since build #143 (Code changes detected) 1 sec
Successful SyntheticAccessorRenamingTests testStaticSetterOnly4 History
Failing since build #143 (Code changes detected) < 1 sec
Successful SyntheticAccessorRenamingTests testStaticSetterOnly4a History
Failing since build #143 (Code changes detected) 1 sec
Successful SyntheticAccessorRenamingTests testSubclassAccess1 History
Failing since build #143 (Code changes detected) 4 secs
Successful SyntheticAccessorRenamingTests testSubclassAccess2 History
Failing since build #143 (Code changes detected) 1 sec

Error summary

The build generated some errors. See the full build log for more details.

SWT SessionManagerDBus: Failed to connect to org.gnome.SessionManager: Failed to execute child process “dbus-launch” (No such file or directory)
SWT SessionManagerDBus: Failed to connect to org.xfce.SessionManager: Failed to execute child process “dbus-launch” (No such file or directory)
TypeInferencingVisitorWithRequestor.findMethodNode: no match found for Main.main([Qjava.lang.String;)
TypeInferencingVisitorWithRequestor.findMethodNode: no match found for Main.main([Qjava.lang.String;)
CodeSelectRequestor: Could not proceed due to null declaring type for org.codehaus.groovy.ast.expr.BinaryExpression@ecbea[org.codehaus.groovy.ast.expr.VariableExpression@ecbe3[variable: it]("in" at 1:20:  "in" )org.codehaus.groovy.ast.expr.ListExpression@ee270[]]
CodeSelectRequestor: Could not proceed due to null declaring type for org.codehaus.groovy.ast.expr.RangeExpression@ebcdd
CodeSelectRequestor: Could not proceed due to null declaring type for org.codehaus.groovy.ast.expr.RangeExpression@ebcde
TypeInferencingVisitorWithRequestor.findMethodNode: no match found for Type.x(QList<Qjava.util.Date;>;)
TypeInferencingVisitorWithRequestor.findMethodNode: no match found for Type.x(QList<Qjava.lang.Number;>;)
TypeInferencingVisitorWithRequestor.findMethodNode: no match found for Type.x(QList<Qjava.lang.Number;>;)
TypeInferencingVisitorWithRequestor.findMethodNode: no match found for Type.x(QList<Qjava.util.Date;>;)
TypeInferencingVisitorWithRequestor.findMethodNode: no match found for Type.x(QList<Qjava.lang.Number;>;)
CodeSelectRequestor: Could not proceed due to null declaring type for org.codehaus.groovy.ast.expr.ConstantExpression@e8fc6[fff]
CodeSelectRequestor: Could not proceed due to null declaring type for org.codehaus.groovy.ast.expr.ConstantExpression@e8fca[fff]
CodeSelectRequestor: Could not proceed due to null declaring type for org.codehaus.groovy.ast.expr.ConstantExpression@e8fca[fff]
Waiting for: Java indexing... 3 files to index (/opt/bamboo-home/xml-data/build-dir/GRECLIPSE-E413-JOB1/ide-test/org.codehaus.groovy.alltests/target/work/plugins/org.eclipse.jdt.groovy.core.tests.builder_3.6.0.v201912091705-e1909/lib/binGroovySearch.jar)
Waiting for: Java indexing... 22 files to index (/Project)
Waiting for: Java indexing... 22 files to index (/Project)
Waiting for: Java indexing... 22 files to index (/Project)
Waiting for: Java indexing... 22 files to index (/Project)
Waiting for: Java indexing... 22 files to index (/Project)
Waiting for: Java indexing... 22 files to index (/Project)
Waiting for: Java indexing... 21 files to index (/Project)
Waiting for: Java indexing... 21 files to index (/Project)
Waiting for: Java indexing... 21 files to index (/Project)
Waiting for: Java indexing... 3 files to index (/Project)