Build: #162 failed

Job: Default Job failed

Stages & jobs

  1. Default Stage

Job result summary

Completed
Duration
93 minutes
Agent
bamboo-17.af.pivotal.io
Revision
53f720a9aef4d040395c923dae4fb20c31255820 53f720a9aef4d040395c923dae4fb20c31255820
Total tests
6264
Fixed in
#164 (Custom build by Eric Milles with revision v3.6.0)

Tests

  • 6,264 tests in total
  • 4 tests failed
  • 4 failures are new
  • 143 tests were quarantined / skipped
  • 89 minutes taken in total.
New test failures 4
Status Test Duration
Collapse Failed BasicGroovyBuildTests testSlow_GRE870 History
< 1 sec
org.junit.ComparisonFailure: unexpected recompiled units. lenExpected=2 lenActual=1 expected:<{Foo[,Test1]}> but was:<{Foo[]}>
	at org.eclipse.jdt.core.groovy.tests.builder.BasicGroovyBuildTests.testSlow_GRE870(BasicGroovyBuildTests.java:1451)
Collapse Failed BasicGroovyBuildTests testTaskMarkerMultipleOnOneLineInSLComment History
< 1 sec
java.lang.AssertionError: Wrong size expected:<3> but was:<0>
	at org.eclipse.jdt.core.groovy.tests.builder.BasicGroovyBuildTests.testTaskMarkerMultipleOnOneLineInSLComment(BasicGroovyBuildTests.java:2530)
Collapse Failed BasicGroovyBuildTests testUpdateWorkspacePreferences History
< 1 sec
java.lang.AssertionError: missing expected problem: Problem : The import util.MyException is never used [ resource : </Project/src/p/Test.java> range : <18,34> category : <120> severity : <1>]
	at org.eclipse.jdt.core.groovy.tests.builder.BasicGroovyBuildTests.testUpdateWorkspacePreferences(BasicGroovyBuildTests.java:3352)
Collapse Failed ConstructorReferenceSearchTests testConstructorReferences10 History
< 1 sec
java.lang.AssertionError: expected:<1> but was:<0>
	at org.eclipse.jdt.core.groovy.tests.search.ConstructorReferenceSearchTests.testConstructorReferences10(ConstructorReferenceSearchTests.java:258)

Error summary

The build generated some errors. See the full build log for more details.

Dec 27, 2019 4:21:50 PM org.apache.http.impl.execchain.RetryExec execute
INFO: I/O exception (org.apache.http.NoHttpResponseException) caught when processing request to {s}->https://download.eclipse.org:443: The target server failed to respond
Dec 27, 2019 4:21:50 PM org.apache.http.impl.execchain.RetryExec execute
INFO: Retrying request to {s}->https://download.eclipse.org:443
SWT SessionManagerDBus: Failed to connect to org.gnome.SessionManager: Failed to execute child process “dbus-launch” (No such file or directory)
SWT SessionManagerDBus: Failed to connect to org.xfce.SessionManager: Failed to execute child process “dbus-launch” (No such file or directory)
TypeInferencingVisitorWithRequestor.findMethodNode: no match found for Main.main([Qjava.lang.String;)
TypeInferencingVisitorWithRequestor.findMethodNode: no match found for Main.main([Qjava.lang.String;)
CodeSelectRequestor: Could not proceed due to null declaring type for org.codehaus.groovy.ast.expr.BinaryExpression@ecbea[org.codehaus.groovy.ast.expr.VariableExpression@ecbe3[variable: it]("in" at 1:20:  "in" )org.codehaus.groovy.ast.expr.ListExpression@ee270[]]
CodeSelectRequestor: Could not proceed due to null declaring type for org.codehaus.groovy.ast.expr.RangeExpression@ebcdd
CodeSelectRequestor: Could not proceed due to null declaring type for org.codehaus.groovy.ast.expr.RangeExpression@ebcde
TypeInferencingVisitorWithRequestor.findMethodNode: no match found for Type.x(QList<Qjava.util.Date;>;)
TypeInferencingVisitorWithRequestor.findMethodNode: no match found for Type.x(QList<Qjava.lang.Number;>;)
TypeInferencingVisitorWithRequestor.findMethodNode: no match found for Type.x(QList<Qjava.lang.Number;>;)
TypeInferencingVisitorWithRequestor.findMethodNode: no match found for Type.x(QList<Qjava.util.Date;>;)
TypeInferencingVisitorWithRequestor.findMethodNode: no match found for Type.x(QList<Qjava.lang.Number;>;)
TypeInferencingVisitorWithRequestor.findMethodNode: no match found for Type.x(QList<Qjava.lang.Number;>;)
CodeSelectRequestor: Could not proceed due to null declaring type for org.codehaus.groovy.ast.expr.ConstantExpression@e8fc6[fff]
CodeSelectRequestor: Could not proceed due to null declaring type for org.codehaus.groovy.ast.expr.ConstantExpression@e8fca[fff]
CodeSelectRequestor: Could not proceed due to null declaring type for org.codehaus.groovy.ast.expr.ConstantExpression@e8fca[fff]
Waiting for: Java indexing... 4 files to index (/Project)
Waiting for: Java indexing... 22 files to index (/Project)
Waiting for: Java indexing... 22 files to index (/Project)
Waiting for: Java indexing... 22 files to index (/Project)
Waiting for: Java indexing... 22 files to index (/Project)
Waiting for: Java indexing... 22 files to index (/Project)
Waiting for: Java indexing... 22 files to index (/Project)
Waiting for: Java indexing... 21 files to index (/Project)
Waiting for: Java indexing... 21 files to index (/Project)
Waiting for: Flushing content description cache.
Waiting for: Java indexing... 21 files to index (/Project)
Waiting for: Java indexing... 19 files to index (/opt/jdk8u232-b09/jre/lib/rt.jar)