Build: #169 failed

Job: Default Job failed

Stages & jobs

  1. Default Stage

Job result summary

Completed
Duration
94 minutes
Agent
bamboo-17.af.pivotal.io
Revision
155ccf51435d003ae0bb5e9ff2b3dd87a13823b8 155ccf51435d003ae0bb5e9ff2b3dd87a13823b8
Total tests
6274
Fixed in
#186 (Code changes detected)

Tests

  • 6,274 tests in total
  • 27 tests failed
  • 27 failures are new
  • 140 tests were quarantined / skipped
  • 90 minutes taken in total.
New test failures 27
Status Test Duration
Collapse Failed RenameMethodTests test1 History
1 sec
org.junit.ComparisonFailure: invalid change expected:<...(){
 }
 void f(){
  [k();
 }
 static int fred(){
  k();
  return 1;
(142 more lines...)
Collapse Failed RenameMethodTests test10 History
< 1 sec
org.eclipse.core.runtime.AssertionFailedException: assertion failed: Search for method declaration did not find original element: void setFoo(String) [in A [in A.groovy [in p [in src [in TestProject]]]]]
	at org.codehaus.groovy.eclipse.refactoring.test.rename.RenameMethodTests.runTest(RenameMethodTests.groovy:50)
	at org.codehaus.groovy.eclipse.refactoring.test.rename.RenameMethodTests.runTest(RenameMethodTests.groovy)
	at org.codehaus.groovy.eclipse.refactoring.test.rename.RenameMethodTests.test10(RenameMethodTests.groovy:126)
Collapse Failed RenameMethodTests test11 History
< 1 sec
org.eclipse.core.runtime.AssertionFailedException: assertion failed: Search for method declaration did not find original element: void setFoo(Integer) [in A [in A.groovy [in p [in src [in TestProject]]]]]
	at org.codehaus.groovy.eclipse.refactoring.test.rename.RenameMethodTests.runTest(RenameMethodTests.groovy:50)
	at org.codehaus.groovy.eclipse.refactoring.test.rename.RenameMethodTests.runTest(RenameMethodTests.groovy)
	at org.codehaus.groovy.eclipse.refactoring.test.rename.RenameMethodTests.test11(RenameMethodTests.groovy:132)
Collapse Failed RenameMethodTests test12 History
< 1 sec
org.eclipse.core.runtime.AssertionFailedException: assertion failed: Search for method declaration did not find original element: void setFoo(Integer) [in A [in A.groovy [in p [in src [in TestProject]]]]]
	at org.codehaus.groovy.eclipse.refactoring.test.rename.RenameMethodTests.runTest(RenameMethodTests.groovy:50)
	at org.codehaus.groovy.eclipse.refactoring.test.rename.RenameMethodTests.runTest(RenameMethodTests.groovy)
	at org.codehaus.groovy.eclipse.refactoring.test.rename.RenameMethodTests.test12(RenameMethodTests.groovy:138)
Collapse Failed RenameMethodTests test13 History
< 1 sec
org.eclipse.core.runtime.AssertionFailedException: assertion failed: Search for method declaration did not find original element: Integer getFoo() [in A [in A.groovy [in p [in src [in TestProject]]]]]
	at org.codehaus.groovy.eclipse.refactoring.test.rename.RenameMethodTests.runTest(RenameMethodTests.groovy:50)
	at org.codehaus.groovy.eclipse.refactoring.test.rename.RenameMethodTests.runTest(RenameMethodTests.groovy:37)
	at org.codehaus.groovy.eclipse.refactoring.test.rename.RenameMethodTests.test13(RenameMethodTests.groovy:144)
Collapse Failed RenameMethodTests test14 History
< 1 sec
org.eclipse.core.runtime.AssertionFailedException: assertion failed: Search for method declaration did not find original element: Integer getFoo() [in A [in A.groovy [in p [in src [in TestProject]]]]]
	at org.codehaus.groovy.eclipse.refactoring.test.rename.RenameMethodTests.runTest(RenameMethodTests.groovy:50)
	at org.codehaus.groovy.eclipse.refactoring.test.rename.RenameMethodTests.runTest(RenameMethodTests.groovy:37)
	at org.codehaus.groovy.eclipse.refactoring.test.rename.RenameMethodTests.test14(RenameMethodTests.groovy:150)
Collapse Failed RenameMethodTests test2 History
< 1 sec
org.eclipse.core.runtime.AssertionFailedException: assertion failed: Search for method declaration did not find original element: void m() [in A [in A.groovy [in p [in src [in TestProject]]]]]
	at org.codehaus.groovy.eclipse.refactoring.test.rename.RenameMethodTests.runTest(RenameMethodTests.groovy:50)
	at org.codehaus.groovy.eclipse.refactoring.test.rename.RenameMethodTests.runTest(RenameMethodTests.groovy:37)
	at org.codehaus.groovy.eclipse.refactoring.test.rename.RenameMethodTests.test2(RenameMethodTests.groovy:78)
Collapse Failed RenameMethodTests test3 History
1 sec
org.junit.ComparisonFailure: invalid change expected:<...      m
            [k()
            this.m
            this.k()
            new A().m
            new A().k()
            def x = new A()
            x.m
(38 more lines...)
Collapse Failed RenameMethodTests test4 History
< 1 sec
org.eclipse.core.runtime.AssertionFailedException: assertion failed: Search for method declaration did not find original element: void m() [in A [in A.groovy [in p [in src [in TestProject]]]]]
	at org.codehaus.groovy.eclipse.refactoring.test.rename.RenameMethodTests.runTest(RenameMethodTests.groovy:50)
	at org.codehaus.groovy.eclipse.refactoring.test.rename.RenameMethodTests.runTest(RenameMethodTests.groovy:37)
	at org.codehaus.groovy.eclipse.refactoring.test.rename.RenameMethodTests.test4(RenameMethodTests.groovy:90)
Collapse Failed RenameMethodTests test5 History
< 1 sec
org.eclipse.core.runtime.AssertionFailedException: assertion failed: Search for method declaration did not find original element: java.lang.Object m() [in A [in A.groovy [in p [in src [in TestProject]]]]]
	at org.codehaus.groovy.eclipse.refactoring.test.rename.RenameMethodTests.runTest(RenameMethodTests.groovy:50)
	at org.codehaus.groovy.eclipse.refactoring.test.rename.RenameMethodTests.runTest(RenameMethodTests.groovy:37)
	at org.codehaus.groovy.eclipse.refactoring.test.rename.RenameMethodTests.test5(RenameMethodTests.groovy:96)
Collapse Failed RenameMethodTests test6 History
< 1 sec
org.eclipse.core.runtime.AssertionFailedException: assertion failed: Search for method declaration did not find original element: java.lang.Object m() [in A [in A.groovy [in p [in src [in TestProject]]]]]
	at org.codehaus.groovy.eclipse.refactoring.test.rename.RenameMethodTests.runTest(RenameMethodTests.groovy:50)
	at org.codehaus.groovy.eclipse.refactoring.test.rename.RenameMethodTests.runTest(RenameMethodTests.groovy:37)
	at org.codehaus.groovy.eclipse.refactoring.test.rename.RenameMethodTests.test6(RenameMethodTests.groovy:102)
Collapse Failed RenameMethodTests test7 History
< 1 sec
org.eclipse.core.runtime.AssertionFailedException: assertion failed: Search for method declaration did not find original element: java.lang.Object m() [in A [in A.groovy [in p [in src [in TestProject]]]]]
	at org.codehaus.groovy.eclipse.refactoring.test.rename.RenameMethodTests.runTest(RenameMethodTests.groovy:50)
	at org.codehaus.groovy.eclipse.refactoring.test.rename.RenameMethodTests.runTest(RenameMethodTests.groovy:37)
	at org.codehaus.groovy.eclipse.refactoring.test.rename.RenameMethodTests.test7(RenameMethodTests.groovy:108)
Collapse Failed RenameMethodTests test8 History
< 1 sec
org.eclipse.core.runtime.AssertionFailedException: assertion failed: Search for method declaration did not find original element: java.lang.Object m() [in B [in A.groovy [in p [in src [in TestProject]]]]]
	at org.codehaus.groovy.eclipse.refactoring.test.rename.RenameMethodTests.runTest(RenameMethodTests.groovy:50)
	at org.codehaus.groovy.eclipse.refactoring.test.rename.RenameMethodTests.runTest(RenameMethodTests.groovy:37)
	at org.codehaus.groovy.eclipse.refactoring.test.rename.RenameMethodTests.test8(RenameMethodTests.groovy:114)
Collapse Failed RenameMethodTests test9 History
< 1 sec
org.eclipse.core.runtime.AssertionFailedException: assertion failed: Search for method declaration did not find original element: java.lang.Object m() [in A [in A.groovy [in p [in src [in TestProject]]]]]
	at org.codehaus.groovy.eclipse.refactoring.test.rename.RenameMethodTests.runTest(RenameMethodTests.groovy:50)
	at org.codehaus.groovy.eclipse.refactoring.test.rename.RenameMethodTests.runTest(RenameMethodTests.groovy:37)
	at org.codehaus.groovy.eclipse.refactoring.test.rename.RenameMethodTests.test9(RenameMethodTests.groovy:120)
Collapse Failed RenameMethodTests testAnonOverrides History
4 secs
org.eclipse.core.runtime.AssertionFailedException: assertion failed: Search for method declaration did not find original element: int run() [in I [in A.groovy [in p [in src [in TestProject]]]]]
	at org.codehaus.groovy.eclipse.refactoring.test.rename.RenameMethodTests.runTest(RenameMethodTests.groovy:50)
	at org.codehaus.groovy.eclipse.refactoring.test.rename.RenameMethodTests.runTest(RenameMethodTests.groovy:37)
	at org.codehaus.groovy.eclipse.refactoring.test.rename.RenameMethodTests.testAnonOverrides(RenameMethodTests.groovy:173)
Collapse Failed RenameMethodTests testDelegate2 History
< 1 sec
org.eclipse.core.runtime.AssertionFailedException: assertion failed: Search for method declaration did not find original element: void m() [in A [in A.groovy [in p [in src [in TestProject]]]]]
	at org.codehaus.groovy.eclipse.refactoring.test.rename.RenameMethodTests.runTest(RenameMethodTests.groovy:50)
	at org.codehaus.groovy.eclipse.refactoring.test.rename.RenameMethodTests.runTest(RenameMethodTests.groovy)
	at org.codehaus.groovy.eclipse.refactoring.test.rename.RenameMethodTests.testDelegate2(RenameMethodTests.groovy:228)
Collapse Failed RenameMethodTests testEnumOverrides History
< 1 sec
org.eclipse.core.runtime.AssertionFailedException: assertion failed: Search for method declaration did not find original element: String getFoo() [in A [in A.groovy [in p [in src [in TestProject]]]]]
	at org.codehaus.groovy.eclipse.refactoring.test.rename.RenameMethodTests.runTest(RenameMethodTests.groovy:50)
	at org.codehaus.groovy.eclipse.refactoring.test.rename.RenameMethodTests.runTest(RenameMethodTests.groovy:37)
	at org.codehaus.groovy.eclipse.refactoring.test.rename.RenameMethodTests.testEnumOverrides(RenameMethodTests.groovy:180)
Collapse Failed RenameMethodTests testEnumOverrides2 History
< 1 sec
org.eclipse.core.runtime.AssertionFailedException: assertion failed: Search for method declaration did not find original element: String getFoo() [in A [in A.groovy [in p [in src [in TestProject]]]]]
	at org.codehaus.groovy.eclipse.refactoring.test.rename.RenameMethodTests.runTest(RenameMethodTests.groovy:50)
	at org.codehaus.groovy.eclipse.refactoring.test.rename.RenameMethodTests.runTest(RenameMethodTests.groovy:37)
	at org.codehaus.groovy.eclipse.refactoring.test.rename.RenameMethodTests.testEnumOverrides2(RenameMethodTests.groovy:187)
Collapse Failed RenameMethodTests testInitializer1 History
< 1 sec
org.eclipse.core.runtime.AssertionFailedException: assertion failed: Search for method declaration did not find original element: java.lang.Object m() [in A [in A.groovy [in p [in src [in TestProject]]]]]
	at org.codehaus.groovy.eclipse.refactoring.test.rename.RenameMethodTests.runTest(RenameMethodTests.groovy:50)
	at org.codehaus.groovy.eclipse.refactoring.test.rename.RenameMethodTests.runTest(RenameMethodTests.groovy:37)
	at org.codehaus.groovy.eclipse.refactoring.test.rename.RenameMethodTests.testInitializer1(RenameMethodTests.groovy:200)
Collapse Failed RenameMethodTests testInitializer2 History
< 1 sec
org.eclipse.core.runtime.AssertionFailedException: assertion failed: Search for method declaration did not find original element: java.lang.Object m() [in A [in A.groovy [in p [in src [in TestProject]]]]]
	at org.codehaus.groovy.eclipse.refactoring.test.rename.RenameMethodTests.runTest(RenameMethodTests.groovy:50)
	at org.codehaus.groovy.eclipse.refactoring.test.rename.RenameMethodTests.runTest(RenameMethodTests.groovy:37)
	at org.codehaus.groovy.eclipse.refactoring.test.rename.RenameMethodTests.testInitializer2(RenameMethodTests.groovy:206)
Collapse Failed RenameMethodTests testInitializer3 History
< 1 sec
org.eclipse.core.runtime.AssertionFailedException: assertion failed: Search for method declaration did not find original element: java.lang.Object m() [in A [in A.groovy [in p [in src [in TestProject]]]]]
	at org.codehaus.groovy.eclipse.refactoring.test.rename.RenameMethodTests.runTest(RenameMethodTests.groovy:50)
	at org.codehaus.groovy.eclipse.refactoring.test.rename.RenameMethodTests.runTest(RenameMethodTests.groovy:37)
	at org.codehaus.groovy.eclipse.refactoring.test.rename.RenameMethodTests.testInitializer3(RenameMethodTests.groovy:212)
Collapse Failed RenameMethodTests testOverload1 History
< 1 sec
org.eclipse.core.runtime.AssertionFailedException: assertion failed: Search for method declaration did not find original element: java.lang.Object m(java.lang.Object) [in I1 [in A.groovy [in p [in src [in TestProject]]]]]
	at org.codehaus.groovy.eclipse.refactoring.test.rename.RenameMethodTests.runTest(RenameMethodTests.groovy:50)
	at org.codehaus.groovy.eclipse.refactoring.test.rename.RenameMethodTests.runTest(RenameMethodTests.groovy)
	at org.codehaus.groovy.eclipse.refactoring.test.rename.RenameMethodTests.testOverload1(RenameMethodTests.groovy:235)
Collapse Failed RenameMethodTests testOverload2 History
< 1 sec
org.eclipse.core.runtime.AssertionFailedException: assertion failed: Search for method declaration did not find original element: java.lang.Object m(java.lang.Object) [in I2 [in A.groovy [in p [in src [in TestProject]]]]]
	at org.codehaus.groovy.eclipse.refactoring.test.rename.RenameMethodTests.runTest(RenameMethodTests.groovy:50)
	at org.codehaus.groovy.eclipse.refactoring.test.rename.RenameMethodTests.runTest(RenameMethodTests.groovy)
	at org.codehaus.groovy.eclipse.refactoring.test.rename.RenameMethodTests.testOverload2(RenameMethodTests.groovy:242)
Collapse Failed RenameMethodTests testOverload3 History
< 1 sec
org.eclipse.core.runtime.AssertionFailedException: assertion failed: Search for method declaration did not find original element: java.lang.Object m(java.lang.Object) [in I1 [in A.groovy [in p [in src [in TestProject]]]]]
	at org.codehaus.groovy.eclipse.refactoring.test.rename.RenameMethodTests.runTest(RenameMethodTests.groovy:50)
	at org.codehaus.groovy.eclipse.refactoring.test.rename.RenameMethodTests.runTest(RenameMethodTests.groovy)
	at org.codehaus.groovy.eclipse.refactoring.test.rename.RenameMethodTests.testOverload3(RenameMethodTests.groovy:249)
Collapse Failed RenameMethodTests testStaticImport History
1 sec
org.junit.ComparisonFailure: invalid change expected:<...port static o.Other.[BAR

FOO
BAR()
o.Other.FOO
o.Other.BAR]()
> but was:<...port static o.Other.[FOO

(22 more lines...)
Collapse Failed BinarySearchTests testFieldRefInInitializer History
1 sec
java.lang.AssertionError: Expecting 1 matches, but found 0

java.lang.AssertionError: 
Expecting 1 matches, but found 0

	at org.eclipse.jdt.core.groovy.tests.search.BinarySearchTests.assertMatches(BinarySearchTests.java:139)
	at org.eclipse.jdt.core.groovy.tests.search.BinarySearchTests.testFieldRefInInitializer(BinarySearchTests.java:208)
Collapse Failed ConstructorReferenceSearchTests testConstructorReferences13 History
< 1 sec
java.lang.AssertionError: expected:<1> but was:<0>
	at org.eclipse.jdt.core.groovy.tests.search.ConstructorReferenceSearchTests.testConstructorReferences13(ConstructorReferenceSearchTests.java:349)

Error summary

The build generated some errors. See the full build log for more details.

Jan 06, 2020 10:34:02 PM org.apache.http.impl.execchain.RetryExec execute
INFO: I/O exception (org.apache.http.NoHttpResponseException) caught when processing request to {s}->https://download.eclipse.org:443: The target server failed to respond
Jan 06, 2020 10:34:02 PM org.apache.http.impl.execchain.RetryExec execute
INFO: Retrying request to {s}->https://download.eclipse.org:443
SWT SessionManagerDBus: Failed to connect to org.gnome.SessionManager: Failed to execute child process “dbus-launch” (No such file or directory)
SWT SessionManagerDBus: Failed to connect to org.xfce.SessionManager: Failed to execute child process “dbus-launch” (No such file or directory)
TypeInferencingVisitorWithRequestor.findMethodNode: no match found for Main.main([Qjava.lang.String;)
TypeInferencingVisitorWithRequestor.findMethodNode: no match found for Main.main([Qjava.lang.String;)
CodeSelectRequestor: Could not proceed due to null declaring type for org.codehaus.groovy.ast.expr.BinaryExpression@ecbea[org.codehaus.groovy.ast.expr.VariableExpression@ecbe3[variable: it]("in" at 1:20:  "in" )org.codehaus.groovy.ast.expr.ListExpression@ee270[]]
CodeSelectRequestor: Could not proceed due to null declaring type for org.codehaus.groovy.ast.expr.RangeExpression@ebcdd
CodeSelectRequestor: Could not proceed due to null declaring type for org.codehaus.groovy.ast.expr.RangeExpression@ebcde
TypeInferencingVisitorWithRequestor.findMethodNode: no match found for Type.x(QList<Qjava.util.Date;>;)
TypeInferencingVisitorWithRequestor.findMethodNode: no match found for Type.x(QList<Qjava.lang.Number;>;)
TypeInferencingVisitorWithRequestor.findMethodNode: no match found for Type.x(QList<Qjava.lang.Number;>;)
TypeInferencingVisitorWithRequestor.findMethodNode: no match found for Type.x(QList<Qjava.util.Date;>;)
TypeInferencingVisitorWithRequestor.findMethodNode: no match found for Type.x(QList<Qjava.lang.Number;>;)
TypeInferencingVisitorWithRequestor.findMethodNode: no match found for Type.x(QList<Qjava.lang.Number;>;)
CodeSelectRequestor: Could not proceed due to null declaring type for org.codehaus.groovy.ast.expr.ConstantExpression@e8fc6[fff]
CodeSelectRequestor: Could not proceed due to null declaring type for org.codehaus.groovy.ast.expr.ConstantExpression@e8fca[fff]
CodeSelectRequestor: Could not proceed due to null declaring type for org.codehaus.groovy.ast.expr.ConstantExpression@e8fca[fff]
Waiting for: Java indexing... 22 files to index (/Project)
Waiting for: Java indexing... 22 files to index (/Project)
Waiting for: Java indexing... 22 files to index (/Project)
Waiting for: Java indexing... 22 files to index (/Project)
Waiting for: Java indexing... 22 files to index (/Project)
Waiting for: Java indexing... 22 files to index (/Project)
Waiting for: Java indexing... 22 files to index (/Project)
Waiting for: Java indexing... 21 files to index (/Project)
Waiting for: Java indexing... 21 files to index (/Project)
Waiting for: Java indexing... 21 files to index (/Project)
Waiting for: Java indexing... 17 files to index (/opt/jdk8u232-b09/jre/lib/rt.jar)