Build: #170 failed

Job: Default Job failed

Stages & jobs

  1. Default Stage

Job result summary

Completed
Duration
93 minutes
Agent
bamboo-17.af.pivotal.io
Revision
8e7a3432be48a1949b75d39b3113b3a1f76ece7d 8e7a3432be48a1949b75d39b3113b3a1f76ece7d
Total tests
6278
Failing since
#169 (Code changes detected – )
Fixed in
#186 (Code changes detected)

Tests

  • 6,278 tests in total
  • 11 tests failed
  • 11 failures are new
  • 27 tests were fixed
  • 140 tests were quarantined / skipped
  • 89 minutes taken in total.
New test failures 11
Status Test Duration
Collapse Failed MoveCURefactoringTests testMoveBack History
1 sec
org.junit.ComparisonFailure: Refactoring produced unexpected results: expected:<package p2
[]
public class Groovy...> but was:<package p2
[import p1.Groovy
]
public class Groovy...>
org.junit.ComparisonFailure: 
Refactoring produced unexpected results: expected:<package p2
(7 more lines...)
Collapse Failed MoveCURefactoringTests testNonPrimaryMove History
1 sec
org.junit.ComparisonFailure: Refactoring produced unexpected results: expected:<package p2
import [NEW].Groovy
public class...> but was:<package p2
import [p1].Groovy
public class...>
org.junit.ComparisonFailure: 
Refactoring produced unexpected results: expected:<package p2
import [NEW].Groovy
(5 more lines...)
Collapse Failed MoveCURefactoringTests testNonPrimaryQualifiedMove History
1 sec
org.junit.ComparisonFailure: Refactoring produced unexpected results: expected:<...ass Groovy2 extends [NEW].Groovy { }> but was:<...ass Groovy2 extends [p1].Groovy { }>
	at org.codehaus.groovy.eclipse.refactoring.test.rename.MoveCURefactoringTests.performRefactoringAndUndo(MoveCURefactoringTests.groovy:67)
	at org.codehaus.groovy.eclipse.refactoring.test.rename.MoveCURefactoringTests.testNonPrimaryQualifiedMove(MoveCURefactoringTests.groovy:235)
Collapse Failed MoveCURefactoringTests testQualifiedMove1 History
1 sec
org.junit.ComparisonFailure: Refactoring produced unexpected results: expected:<...lass Groovy extends [NEW].Java { }> but was:<...lass Groovy extends [p].Java { }>
	at org.codehaus.groovy.eclipse.refactoring.test.rename.MoveCURefactoringTests.performRefactoringAndUndo(MoveCURefactoringTests.groovy:67)
	at org.codehaus.groovy.eclipse.refactoring.test.rename.MoveCURefactoringTests.testQualifiedMove1(MoveCURefactoringTests.groovy:144)
Collapse Failed MoveCURefactoringTests testQualifiedMove2 History
1 sec
org.junit.ComparisonFailure: Refactoring produced unexpected results: expected:<...ass Groovy2 extends [NEW].Groovy { }> but was:<...ass Groovy2 extends [p1].Groovy { }>
	at org.codehaus.groovy.eclipse.refactoring.test.rename.MoveCURefactoringTests.performRefactoringAndUndo(MoveCURefactoringTests.groovy:67)
	at org.codehaus.groovy.eclipse.refactoring.test.rename.MoveCURefactoringTests.testQualifiedMove2(MoveCURefactoringTests.groovy:157)
Collapse Failed MoveCURefactoringTests testQualifiedMove3 History
1 sec
org.junit.ComparisonFailure: Refactoring produced unexpected results: expected:<... g1

import static j[2.Java.*
import j2.Java

class Groovy {
  def m1() {
    Java j = new j2].Java()
(33 more lines...)
Collapse Failed MoveCURefactoringTests testSimpleMove3 History
1 sec
org.junit.ComparisonFailure: Refactoring produced unexpected results: expected:<package p;
[
import NEW.Java

]public class Groovy ...> but was:<package p;
[]public class Groovy ...>
org.junit.ComparisonFailure: 
Refactoring produced unexpected results: expected:<package p;
(7 more lines...)
Collapse Failed MoveCURefactoringTests testSimpleMove4 History
< 1 sec
org.junit.ComparisonFailure: Refactoring produced unexpected results: expected:<package p2
import [NEW].Groovy
public class...> but was:<package p2
import [p1].Groovy
public class...>
org.junit.ComparisonFailure: 
Refactoring produced unexpected results: expected:<package p2
import [NEW].Groovy
(5 more lines...)
Collapse Failed BinarySearchTests testClassDecl1 History
1 sec
java.lang.AssertionError: Expecting 12 matches, but found 0

java.lang.AssertionError: 
Expecting 12 matches, but found 0

	at org.eclipse.jdt.core.groovy.tests.search.BinarySearchTests.assertMatches(BinarySearchTests.java:139)
	at org.eclipse.jdt.core.groovy.tests.search.BinarySearchTests.testClassDecl1(BinarySearchTests.java:165)
Collapse Failed ConstructorReferenceSearchTests testConstructorReferences5 History
< 1 sec
java.lang.AssertionError: expected:<1> but was:<0>
	at org.eclipse.jdt.core.groovy.tests.search.ConstructorReferenceSearchTests.testConstructorReferences5(ConstructorReferenceSearchTests.java:162)
Collapse Failed DGMInferencingTests testDGM9 History
< 1 sec
java.lang.AssertionError: Expected type not found.
Expected: java.lang.Integer
Found: java.lang.Object
Declaring type: groovy.lang.Closure<V extends java.lang.Object>
ASTNode: org.codehaus.groovy.ast.expr.VariableExpression@ed729[variable: it]
Confidence: INFERRED

java.lang.AssertionError: 
(9 more lines...)
Fixed tests 27
Status Test Failing since Duration
Successful RenameMethodTests test1 History
Failing since build #169 (Code changes detected) 1 sec
Successful RenameMethodTests test10 History
Failing since build #169 (Code changes detected) 1 sec
Successful RenameMethodTests test11 History
Failing since build #169 (Code changes detected) 1 sec
Successful RenameMethodTests test12 History
Failing since build #169 (Code changes detected) 1 sec
Successful RenameMethodTests test13 History
Failing since build #169 (Code changes detected) 1 sec
Successful RenameMethodTests test14 History
Failing since build #169 (Code changes detected) 1 sec
Successful RenameMethodTests test2 History
Failing since build #169 (Code changes detected) 1 sec
Successful RenameMethodTests test3 History
Failing since build #169 (Code changes detected) 1 sec
Successful RenameMethodTests test4 History
Failing since build #169 (Code changes detected) 1 sec
Successful RenameMethodTests test5 History
Failing since build #169 (Code changes detected) 1 sec
Successful RenameMethodTests test6 History
Failing since build #169 (Code changes detected) 1 sec
Successful RenameMethodTests test7 History
Failing since build #169 (Code changes detected) 1 sec
Successful RenameMethodTests test8 History
Failing since build #169 (Code changes detected) 1 sec
Successful RenameMethodTests test9 History
Failing since build #169 (Code changes detected) 1 sec
Successful RenameMethodTests testAnonOverrides History
Failing since build #169 (Code changes detected) 10 secs
Successful RenameMethodTests testDelegate2 History
Failing since build #169 (Code changes detected) 1 sec
Successful RenameMethodTests testEnumOverrides History
Failing since build #169 (Code changes detected) 1 sec
Successful RenameMethodTests testEnumOverrides2 History
Failing since build #169 (Code changes detected) 1 sec
Successful RenameMethodTests testInitializer1 History
Failing since build #169 (Code changes detected) 1 sec
Successful RenameMethodTests testInitializer2 History
Failing since build #169 (Code changes detected) 1 sec
Successful RenameMethodTests testInitializer3 History
Failing since build #169 (Code changes detected) 1 sec
Successful RenameMethodTests testOverload1 History
Failing since build #169 (Code changes detected) 2 secs
Successful RenameMethodTests testOverload2 History
Failing since build #169 (Code changes detected) 2 secs
Successful RenameMethodTests testOverload3 History
Failing since build #169 (Code changes detected) 2 secs
Successful RenameMethodTests testStaticImport History
Failing since build #169 (Code changes detected) 1 sec
Successful BinarySearchTests testFieldRefInInitializer History
Failing since build #169 (Code changes detected) 1 sec
Successful ConstructorReferenceSearchTests testConstructorReferences13 History
Failing since build #169 (Code changes detected) < 1 sec

Error summary

The build generated some errors. See the full build log for more details.

Jan 07, 2020 10:54:58 PM org.apache.http.impl.execchain.RetryExec execute
INFO: I/O exception (org.apache.http.NoHttpResponseException) caught when processing request to {s}->https://download.eclipse.org:443: The target server failed to respond
Jan 07, 2020 10:54:58 PM org.apache.http.impl.execchain.RetryExec execute
INFO: Retrying request to {s}->https://download.eclipse.org:443
SWT SessionManagerDBus: Failed to connect to org.gnome.SessionManager: Failed to execute child process “dbus-launch” (No such file or directory)
SWT SessionManagerDBus: Failed to connect to org.xfce.SessionManager: Failed to execute child process “dbus-launch” (No such file or directory)
TypeInferencingVisitorWithRequestor.findMethodNode: no match found for Main.main([Qjava.lang.String;)
TypeInferencingVisitorWithRequestor.findMethodNode: no match found for Main.main([Qjava.lang.String;)
CodeSelectRequestor: Could not proceed due to null declaring type for org.codehaus.groovy.ast.expr.BinaryExpression@ecbea[org.codehaus.groovy.ast.expr.VariableExpression@ecbe3[variable: it]("in" at 1:20:  "in" )org.codehaus.groovy.ast.expr.ListExpression@ee270[]]
CodeSelectRequestor: Could not proceed due to null declaring type for org.codehaus.groovy.ast.expr.RangeExpression@ebcdd
CodeSelectRequestor: Could not proceed due to null declaring type for org.codehaus.groovy.ast.expr.RangeExpression@ebcde
TypeInferencingVisitorWithRequestor.findMethodNode: no match found for Type.x(QList<Qjava.util.Date;>;)
TypeInferencingVisitorWithRequestor.findMethodNode: no match found for Type.x(QList<Qjava.lang.Number;>;)
TypeInferencingVisitorWithRequestor.findMethodNode: no match found for Type.x(QList<Qjava.lang.Number;>;)
TypeInferencingVisitorWithRequestor.findMethodNode: no match found for Type.x(QList<Qjava.util.Date;>;)
TypeInferencingVisitorWithRequestor.findMethodNode: no match found for Type.x(QList<Qjava.lang.Number;>;)
TypeInferencingVisitorWithRequestor.findMethodNode: no match found for Type.x(QList<Qjava.lang.Number;>;)
CodeSelectRequestor: Could not proceed due to null declaring type for org.codehaus.groovy.ast.expr.ConstantExpression@e8fc6[fff]
CodeSelectRequestor: Could not proceed due to null declaring type for org.codehaus.groovy.ast.expr.ConstantExpression@e8fca[fff]
CodeSelectRequestor: Could not proceed due to null declaring type for org.codehaus.groovy.ast.expr.ConstantExpression@e8fca[fff]
Waiting for: Java indexing... 22 files to index (/Project)
Waiting for: Building workspace
Waiting for: Java indexing... 22 files to index (/Project)
Waiting for: Java indexing... 22 files to index (/Project)
Waiting for: Java indexing... 22 files to index (/Project)
Waiting for: Java indexing... 4 files to index (/opt/bamboo-home/xml-data/build-dir/GRECLIPSE-E413-JOB1/ide-test/org.codehaus.groovy.alltests/target/work/plugins/org.eclipse.jdt.groovy.core.tests.builder_3.7.0.v202001072254-e1909/lib/binGroovySearch.jar)
Waiting for: Java indexing... 22 files to index (/Project)
Waiting for: Java indexing... 22 files to index (/Project)
Waiting for: Java indexing... 21 files to index (/Project)
Waiting for: Java indexing... 21 files to index (/Project)
Waiting for: Java indexing... 21 files to index (/Project)
Waiting for: Flushing content description cache.
Waiting for: Java indexing... 19 files to index (/opt/jdk8u232-b09/jre/lib/rt.jar)