Build: #171 failed

Job: Default Job failed

Stages & jobs

  1. Default Stage

Job result summary

Completed
Duration
94 minutes
Agent
bamboo-17.af.pivotal.io
Revision
a86588995f5fe394d7949ef7a432e3e7e13a1051 a86588995f5fe394d7949ef7a432e3e7e13a1051
Total tests
6278
Failing since
#169 (Code changes detected – )
Fixed in
#186 (Code changes detected)

Tests

  • 6,278 tests in total
  • 6 tests failed
  • 6 failures are new
  • 11 tests were fixed
  • 140 tests were quarantined / skipped
  • 89 minutes taken in total.
New test failures 6
Status Test Duration
Collapse Failed BasicGroovyBuildTests testBuildJavaHelloWorld History
< 1 sec
org.junit.ComparisonFailure: unexpected recompiled units. lenExpected=1 lenActual=2 expected:<{p1.Hello[]}> but was:<{p1.Hello[,p1.Hello]}>
	at org.eclipse.jdt.core.groovy.tests.builder.BasicGroovyBuildTests.testBuildJavaHelloWorld(BasicGroovyBuildTests.java:175)
Collapse Failed BinarySearchTests testFieldRefInInitializer History
1 sec
java.lang.AssertionError: Expecting 1 matches, but found 0

java.lang.AssertionError: 
Expecting 1 matches, but found 0

	at org.eclipse.jdt.core.groovy.tests.search.BinarySearchTests.assertMatches(BinarySearchTests.java:139)
	at org.eclipse.jdt.core.groovy.tests.search.BinarySearchTests.testFieldRefInInitializer(BinarySearchTests.java:208)
Collapse Failed ClosureInferencingTests testClosureReturnType4 History
< 1 sec
java.lang.AssertionError: Expected type not found.
Expected: Foo[]
Found: java.lang.String
Declaring type: Search
ASTNode: org.codehaus.groovy.ast.expr.VariableExpression@1070c4[variable: arr]
Confidence: INFERRED

java.lang.AssertionError: 
(8 more lines...)
Collapse Failed ConstructorReferenceSearchTests testConstructorReferences11a History
< 1 sec
java.lang.AssertionError: expected:<3> but was:<0>
	at org.eclipse.jdt.core.groovy.tests.search.ConstructorReferenceSearchTests.testConstructorReferences11a(ConstructorReferenceSearchTests.java:295)
Collapse Failed ConstructorReferenceSearchTests testNewifyConstructorReferences2 History
< 1 sec
java.lang.AssertionError: expected:<2> but was:<0>
	at org.eclipse.jdt.core.groovy.tests.search.ConstructorReferenceSearchTests.testNewifyConstructorReferences2(ConstructorReferenceSearchTests.java:408)
Collapse Failed ConstructorReferenceSearchTests testNewifyConstructorReferences4 History
< 1 sec
java.lang.AssertionError: expected:<2> but was:<0>
	at org.eclipse.jdt.core.groovy.tests.search.ConstructorReferenceSearchTests.testNewifyConstructorReferences4(ConstructorReferenceSearchTests.java:450)
Fixed tests 11
Status Test Failing since Duration
Successful MoveCURefactoringTests testMoveBack History
Failing since build #170 (Code changes detected) 1 sec
Successful MoveCURefactoringTests testNonPrimaryMove History
Failing since build #170 (Code changes detected) 1 sec
Successful MoveCURefactoringTests testNonPrimaryQualifiedMove History
Failing since build #170 (Code changes detected) 1 sec
Successful MoveCURefactoringTests testQualifiedMove1 History
Failing since build #170 (Code changes detected) 1 sec
Successful MoveCURefactoringTests testQualifiedMove2 History
Failing since build #170 (Code changes detected) 1 sec
Successful MoveCURefactoringTests testQualifiedMove3 History
Failing since build #170 (Code changes detected) 1 sec
Successful MoveCURefactoringTests testSimpleMove3 History
Failing since build #170 (Code changes detected) 1 sec
Successful MoveCURefactoringTests testSimpleMove4 History
Failing since build #170 (Code changes detected) 1 sec
Successful BinarySearchTests testClassDecl1 History
Failing since build #170 (Code changes detected) 1 sec
Successful ConstructorReferenceSearchTests testConstructorReferences5 History
Failing since build #170 (Code changes detected) < 1 sec
Successful DGMInferencingTests testDGM9 History
Failing since build #170 (Code changes detected) < 1 sec

Error summary

The build generated some errors. See the full build log for more details.

Jan 08, 2020 4:16:33 PM org.apache.http.impl.execchain.RetryExec execute
INFO: I/O exception (org.apache.http.NoHttpResponseException) caught when processing request to {s}->https://download.eclipse.org:443: The target server failed to respond
Jan 08, 2020 4:16:33 PM org.apache.http.impl.execchain.RetryExec execute
INFO: Retrying request to {s}->https://download.eclipse.org:443
SWT SessionManagerDBus: Failed to connect to org.gnome.SessionManager: Failed to execute child process “dbus-launch” (No such file or directory)
SWT SessionManagerDBus: Failed to connect to org.xfce.SessionManager: Failed to execute child process “dbus-launch” (No such file or directory)
TypeInferencingVisitorWithRequestor.findMethodNode: no match found for Main.main([Qjava.lang.String;)
TypeInferencingVisitorWithRequestor.findMethodNode: no match found for Main.main([Qjava.lang.String;)
CodeSelectRequestor: Could not proceed due to null declaring type for org.codehaus.groovy.ast.expr.BinaryExpression@ecbea[org.codehaus.groovy.ast.expr.VariableExpression@ecbe3[variable: it]("in" at 1:20:  "in" )org.codehaus.groovy.ast.expr.ListExpression@ee270[]]
CodeSelectRequestor: Could not proceed due to null declaring type for org.codehaus.groovy.ast.expr.RangeExpression@ebcdd
CodeSelectRequestor: Could not proceed due to null declaring type for org.codehaus.groovy.ast.expr.RangeExpression@ebcde
TypeInferencingVisitorWithRequestor.findMethodNode: no match found for Type.x(QList<Qjava.util.Date;>;)
TypeInferencingVisitorWithRequestor.findMethodNode: no match found for Type.x(QList<Qjava.lang.Number;>;)
TypeInferencingVisitorWithRequestor.findMethodNode: no match found for Type.x(QList<Qjava.lang.Number;>;)
TypeInferencingVisitorWithRequestor.findMethodNode: no match found for Type.x(QList<Qjava.util.Date;>;)
TypeInferencingVisitorWithRequestor.findMethodNode: no match found for Type.x(QList<Qjava.lang.Number;>;)
TypeInferencingVisitorWithRequestor.findMethodNode: no match found for Type.x(QList<Qjava.lang.Number;>;)
CodeSelectRequestor: Could not proceed due to null declaring type for org.codehaus.groovy.ast.expr.ConstantExpression@e8fc6[fff]
CodeSelectRequestor: Could not proceed due to null declaring type for org.codehaus.groovy.ast.expr.ConstantExpression@e8fca[fff]
CodeSelectRequestor: Could not proceed due to null declaring type for org.codehaus.groovy.ast.expr.ConstantExpression@e8fca[fff]
Waiting for: Java indexing... 4 files to index (/Project)
Waiting for: Building workspace
Waiting for: Java indexing... 22 files to index (/Project)
Waiting for: Java indexing... 22 files to index (/Project)
Waiting for: Java indexing... 4 files to index (/opt/bamboo-home/xml-data/build-dir/GRECLIPSE-E413-JOB1/ide-test/org.codehaus.groovy.alltests/target/work/plugins/org.eclipse.jdt.groovy.core.tests.builder_3.7.0.v202001081616-e1909/lib/binGroovySearch.jar)
Waiting for: Java indexing... 22 files to index (/Project)
Waiting for: Java indexing... 22 files to index (/Project)
Waiting for: Java indexing... 5 files to index (/Project)
Waiting for: Java indexing... 21 files to index (/Project)
Waiting for: Java indexing... 21 files to index (/Project)
Waiting for: Flushing content description cache.
Waiting for: Java indexing... 21 files to index (/Project)
Waiting for: Java indexing... 3 files to index (/Project)