Build: #172 failed

Job: Default Job failed

Stages & jobs

  1. Default Stage

Job result summary

Completed
Duration
94 minutes
Agent
bamboo-16.af.pivotal.io
Revision
f690a2420a98b4e4febae635ffac39c4a077c08c f690a2420a98b4e4febae635ffac39c4a077c08c
Total tests
6279
Failing since
#169 (Code changes detected – )
Fixed in
#186 (Code changes detected)

Tests

  • 6,279 tests in total
  • 37 tests failed
  • 37 failures are new
  • 6 tests were fixed
  • 140 tests were quarantined / skipped
  • 89 minutes taken in total.
New test failures 37
Status Test Duration
Collapse Failed SyntheticAccessorRenamingTests testAliasedAccess History
1 sec
org.junit.ComparisonFailure: Refactoring produced unexpected results: expected:<...tatic p.First.getFoo[Bar as blah
import static p.First.getFooBar] as getF
class First...> but was:<...tatic p.First.getFoo[ as blah
import static p.First.getFoo] as getF
class First...>
org.junit.ComparisonFailure: 
Refactoring produced unexpected results: expected:<...tatic p.First.getFoo[Bar as blah
import static p.First.getFooBar] as getF
(5 more lines...)
Collapse Failed SyntheticAccessorRenamingTests testConstructorAccess History
1 sec
org.junit.ComparisonFailure: Refactoring produced unexpected results: expected:<...def one = new p.One([boo: null)
def two = new p.Two(b]oo: null, bar: null)...> but was:<...def one = new p.One([foo: null)
def two = new p.Two(f]oo: null, bar: null)...>
org.junit.ComparisonFailure: 
Refactoring produced unexpected results: expected:<...def one = new p.One([boo: null)
def two = new p.Two(b]oo: null, bar: null)...> but was:<...def one = new p.One([foo: null)
def two = new p.Two(f]oo: null, bar: null)...>
	at org.codehaus.groovy.eclipse.refactoring.test.rename.SyntheticAccessorRenamingTests.performRefactoringAndUndo(SyntheticAccessorRenamingTests.groovy:53)
(1 more lines...)
Collapse Failed SyntheticAccessorRenamingTests testFieldAndGetterAndSetter1 History
1 sec
org.junit.ComparisonFailure: Refactoring produced unexpected results: expected:<...() { return this.foo[Bar }
  void setFoo(int value) { this.fooBar] = value }
}
> but was:<...() { return this.foo[ }
  void setFoo(int value) { this.foo] = value }
}
>
org.junit.ComparisonFailure: 
(9 more lines...)
Collapse Failed SyntheticAccessorRenamingTests testFieldAndGetterAndSetter2 History
1 sec
org.junit.ComparisonFailure: Refactoring produced unexpected results: expected:<... getFoo() { this.foo[Bar.get() }
  void setFoo(int value) { this.fooBar].set(value) }
}
> but was:<... getFoo() { this.foo[.get() }
  void setFoo(int value) { this.foo].set(value) }
}
>
org.junit.ComparisonFailure: 
(9 more lines...)
Collapse Failed SyntheticAccessorRenamingTests testFieldAndGetterAndSetter3 History
1 sec
org.eclipse.core.runtime.AssertionFailedException: assertion failed: 
	at org.codehaus.groovy.eclipse.refactoring.test.rename.SyntheticAccessorRenamingTests.performRefactoringAndUndo(SyntheticAccessorRenamingTests.groovy:52)
	at org.codehaus.groovy.eclipse.refactoring.test.rename.SyntheticAccessorRenamingTests.testFieldAndGetterAndSetter3(SyntheticAccessorRenamingTests.groovy:1463)
Collapse Failed SyntheticAccessorRenamingTests testFieldAndGetterAndSetter4 History
1 sec
org.eclipse.core.runtime.AssertionFailedException: assertion failed: 
	at org.codehaus.groovy.eclipse.refactoring.test.rename.SyntheticAccessorRenamingTests.performRefactoringAndUndo(SyntheticAccessorRenamingTests.groovy:52)
	at org.codehaus.groovy.eclipse.refactoring.test.rename.SyntheticAccessorRenamingTests.testFieldAndGetterAndSetter4(SyntheticAccessorRenamingTests.groovy:1508)
Collapse Failed SyntheticAccessorRenamingTests testGetterOnly History
1 sec
org.eclipse.core.runtime.AssertionFailedException: assertion failed: Search for method declaration did not find original element: java.lang.Object getFoo() [in First [in First.groovy [in p [in src [in TestProject]]]]]
	at org.codehaus.groovy.eclipse.refactoring.test.rename.SyntheticAccessorRenamingTests.performRefactoringAndUndo(SyntheticAccessorRenamingTests.groovy:52)
	at org.codehaus.groovy.eclipse.refactoring.test.rename.SyntheticAccessorRenamingTests.testGetterOnly(SyntheticAccessorRenamingTests.groovy:663)
Collapse Failed SyntheticAccessorRenamingTests testIsserOnly History
1 sec
org.eclipse.core.runtime.AssertionFailedException: assertion failed: Search for method declaration did not find original element: java.lang.Object isFoo() [in First [in First.groovy [in p [in src [in TestProject]]]]]
	at org.codehaus.groovy.eclipse.refactoring.test.rename.SyntheticAccessorRenamingTests.performRefactoringAndUndo(SyntheticAccessorRenamingTests.groovy:52)
	at org.codehaus.groovy.eclipse.refactoring.test.rename.SyntheticAccessorRenamingTests.testIsserOnly(SyntheticAccessorRenamingTests.groovy:716)
Collapse Failed SyntheticAccessorRenamingTests testJavaRename1 History
1 sec
org.junit.ComparisonFailure: Refactoring produced unexpected results: expected:<...p.First f) {
    f.f[lar = null;
    f.isFlar();
    f.getFlar();
    f.setFlar](true);
  }
}
> but was:<...p.First f) {
(25 more lines...)
Collapse Failed SyntheticAccessorRenamingTests testJavaRename2 History
1 sec
org.junit.ComparisonFailure: Refactoring produced unexpected results: expected:<...p.First f) {
    f.f[lar] = null;
    f.isFoo...> but was:<...p.First f) {
    f.f[oo] = null;
    f.isFoo...>
org.junit.ComparisonFailure: 
Refactoring produced unexpected results: expected:<...p.First f) {
    f.f[lar] = null;
(5 more lines...)
Collapse Failed SyntheticAccessorRenamingTests testMultiFileRename1 History
1 sec
org.junit.ComparisonFailure: Refactoring produced unexpected results: expected:<... = new p.First()
f.f[lar
f.isFlar()
f.getFlar()
f.setFlar](true)
> but was:<... = new p.First()
f.f[oo
f.isFoo()
(17 more lines...)
Collapse Failed SyntheticAccessorRenamingTests testMultiFileRename2 History
1 sec
org.junit.ComparisonFailure: Refactoring produced unexpected results: expected:<package q
p.First.f[lar
p.First.isFlar()
p.First.getFlar()
p.First.setFlar](true)
> but was:<package q
p.First.f[oo
p.First.isFoo()
(17 more lines...)
Collapse Failed SyntheticAccessorRenamingTests testMultiFileRename5 History
1 sec
org.eclipse.core.runtime.AssertionFailedException: assertion failed: Search for method declaration did not find original element: int getFoo() [in Pojo [in Pojo.java [in p [in src [in TestProject]]]]]
	at org.codehaus.groovy.eclipse.refactoring.test.rename.SyntheticAccessorRenamingTests.performRefactoringAndUndo(SyntheticAccessorRenamingTests.groovy:52)
	at org.codehaus.groovy.eclipse.refactoring.test.rename.SyntheticAccessorRenamingTests.testMultiFileRename5(SyntheticAccessorRenamingTests.groovy:417)
Collapse Failed SyntheticAccessorRenamingTests testMultiFileRename6 History
1 sec
org.eclipse.core.runtime.AssertionFailedException: assertion failed: Search for method declaration did not find original element: void setFoo(int) [in Pojo [in Pojo.java [in p [in src [in TestProject]]]]]
	at org.codehaus.groovy.eclipse.refactoring.test.rename.SyntheticAccessorRenamingTests.performRefactoringAndUndo(SyntheticAccessorRenamingTests.groovy:52)
	at org.codehaus.groovy.eclipse.refactoring.test.rename.SyntheticAccessorRenamingTests.testMultiFileRename6(SyntheticAccessorRenamingTests.groovy:464)
Collapse Failed SyntheticAccessorRenamingTests testMultiFileRename7 History
1 sec
org.eclipse.core.runtime.AssertionFailedException: assertion failed: 
	at org.codehaus.groovy.eclipse.refactoring.test.rename.SyntheticAccessorRenamingTests.performRefactoringAndUndo(SyntheticAccessorRenamingTests.groovy:52)
	at org.codehaus.groovy.eclipse.refactoring.test.rename.SyntheticAccessorRenamingTests.testMultiFileRename7(SyntheticAccessorRenamingTests.groovy:513)
Collapse Failed SyntheticAccessorRenamingTests testSetterOnly1 History
< 1 sec
org.eclipse.core.runtime.AssertionFailedException: assertion failed: Search for method declaration did not find original element: void setFoo(java.lang.Object) [in First [in First.groovy [in p [in src [in TestProject]]]]]
	at org.codehaus.groovy.eclipse.refactoring.test.rename.SyntheticAccessorRenamingTests.performRefactoringAndUndo(SyntheticAccessorRenamingTests.groovy:52)
	at org.codehaus.groovy.eclipse.refactoring.test.rename.SyntheticAccessorRenamingTests.testSetterOnly1(SyntheticAccessorRenamingTests.groovy:769)
Collapse Failed SyntheticAccessorRenamingTests testSetterOnly2 History
1 sec
org.eclipse.core.runtime.AssertionFailedException: assertion failed: Search for method declaration did not find original element: void setFoo(java.lang.Object) [in First [in First.groovy [in p [in src [in TestProject]]]]]
	at org.codehaus.groovy.eclipse.refactoring.test.rename.SyntheticAccessorRenamingTests.performRefactoringAndUndo(SyntheticAccessorRenamingTests.groovy:52)
	at org.codehaus.groovy.eclipse.refactoring.test.rename.SyntheticAccessorRenamingTests.testSetterOnly2(SyntheticAccessorRenamingTests.groovy:808)
Collapse Failed SyntheticAccessorRenamingTests testSetterOnly2a History
1 sec
org.eclipse.core.runtime.AssertionFailedException: assertion failed: Search for method declaration did not find original element: void setFoo(java.lang.Object) [in First [in First.groovy [in p [in src [in TestProject]]]]]
	at org.codehaus.groovy.eclipse.refactoring.test.rename.SyntheticAccessorRenamingTests.performRefactoringAndUndo(SyntheticAccessorRenamingTests.groovy:52)
	at org.codehaus.groovy.eclipse.refactoring.test.rename.SyntheticAccessorRenamingTests.testSetterOnly2a(SyntheticAccessorRenamingTests.groovy:850)
Collapse Failed SyntheticAccessorRenamingTests testSingleFileRename1 History
1 sec
org.junit.ComparisonFailure: Refactoring produced unexpected results: expected:<...
  def run() {
    f[lar
    isFlar()
    getFlar()
    setFlar(true)
    this.&isFlar
    this.&getFlar
(41 more lines...)
Collapse Failed SyntheticAccessorRenamingTests testSingleFileRename2 History
1 sec
org.junit.ComparisonFailure: Refactoring produced unexpected results: expected:<...lar
  static {
    f[lar
    isFlar()
    getFlar()
    setFlar(true)
    this.&isFlar
    this.&getFlar
(41 more lines...)
Collapse Failed SyntheticAccessorRenamingTests testSingleFileRename3 History
1 sec
org.junit.ComparisonFailure: Refactoring produced unexpected results: expected:<...
  def run() {
    f[lar]
    isFoo()
    get...> but was:<...
  def run() {
    f[oo]
    isFoo()
(13 more lines...)
Collapse Failed SyntheticAccessorRenamingTests testSingleFileRename4 History
1 sec
org.junit.ComparisonFailure: Refactoring produced unexpected results: expected:<... {}
  static {
    f[lar]
    isFoo()
    get...> but was:<... {}
  static {
    f[oo]
    isFoo()
(13 more lines...)
Collapse Failed SyntheticAccessorRenamingTests testStaticGetterOnly1 History
1 sec
org.junit.ComparisonFailure: Refactoring produced unexpected results: expected:<...Object o = p.First.f[lar; // error
    o = p.First.getFlar]();
  }
}
> but was:<...Object o = p.First.f[oo; // error
    o = p.First.getFoo]();
  }
}
(13 more lines...)
Collapse Failed SyntheticAccessorRenamingTests testStaticGetterOnly2 History
1 sec
org.junit.ComparisonFailure: Refactoring produced unexpected results: expected:<... static p.First.getF[lar;
class Java {
  void m() {
    Object o = foo; // error
    o = getFlar]();
  }
}
> but was:<... static p.First.getF[oo;
(25 more lines...)
Collapse Failed SyntheticAccessorRenamingTests testStaticIsserOnly1 History
1 sec
org.junit.ComparisonFailure: Refactoring produced unexpected results: expected:<...oolean b = p.First.f[lar; // error
    b = p.First.isFlar]();
  }
}
> but was:<...oolean b = p.First.f[oo; // error
    b = p.First.isFoo]();
  }
}
(13 more lines...)
Collapse Failed SyntheticAccessorRenamingTests testStaticIsserOnly2 History
1 sec
org.junit.ComparisonFailure: Refactoring produced unexpected results: expected:<...t static p.First.isF[lar;
class Java {
  void m() {
    boolean b = foo; // error
    b = isFlar]();
  }
}
> but was:<...t static p.First.isF[oo;
(25 more lines...)
Collapse Failed SyntheticAccessorRenamingTests testStaticSetterOnly1 History
1 sec
org.junit.ComparisonFailure: Refactoring produced unexpected results: expected:<... m() {
    p.First.f[lar = null; // error
    p.First.setFlar](null);
  }
}
> but was:<... m() {
    p.First.f[oo = null; // error
    p.First.setFoo](null);
(17 more lines...)
Collapse Failed SyntheticAccessorRenamingTests testStaticSetterOnly2 History
1 sec
org.junit.ComparisonFailure: Refactoring produced unexpected results: expected:<... static p.First.setF[lar;
class Java {
  void m() {
    foo = null; // error
    setFlar](null);
  }
}
> but was:<... static p.First.setF[oo;
(25 more lines...)
Collapse Failed SyntheticAccessorRenamingTests testStaticSetterOnly4 History
1 sec
org.junit.ComparisonFailure: Refactoring produced unexpected results: expected:<...omething() {
    foo[Bar] // ambiguous refere...> but was:<...omething() {
    foo[] // ambiguous refere...>
org.junit.ComparisonFailure: 
Refactoring produced unexpected results: expected:<...omething() {
    foo[Bar] // ambiguous refere...> but was:<...omething() {
    foo[] // ambiguous refere...>
	at org.codehaus.groovy.eclipse.refactoring.test.rename.SyntheticAccessorRenamingTests.performRefactoringAndUndo(SyntheticAccessorRenamingTests.groovy:53)
(1 more lines...)
Collapse Failed SyntheticAccessorRenamingTests testStaticSetterOnly4a History
1 sec
org.junit.ComparisonFailure: Refactoring produced unexpected results: expected:<...omething() {
    foo[Bar] // ambiguous refere...> but was:<...omething() {
    foo[] // ambiguous refere...>
org.junit.ComparisonFailure: 
Refactoring produced unexpected results: expected:<...omething() {
    foo[Bar] // ambiguous refere...> but was:<...omething() {
    foo[] // ambiguous refere...>
	at org.codehaus.groovy.eclipse.refactoring.test.rename.SyntheticAccessorRenamingTests.performRefactoringAndUndo(SyntheticAccessorRenamingTests.groovy:53)
(1 more lines...)
Collapse Failed SyntheticAccessorRenamingTests testSubclassAccess1 History
4 secs
org.junit.ComparisonFailure: Refactoring produced unexpected results: expected:<package q
p.Two.foo[Bar
p.Two.getFooBar()
p.Two.setFooBar](null)
> but was:<package q
p.Two.foo[
p.Two.getFoo()
p.Two.setFoo](null)
(13 more lines...)
Collapse Failed SyntheticAccessorRenamingTests testSubclassAccess2 History
1 sec
org.junit.ComparisonFailure: Refactoring produced unexpected results: expected:<... new p.Two()
two.foo[Bar
two.getFooBar()
two.setFooBar](null)
> but was:<... new p.Two()
two.foo[
two.getFoo()
two.setFoo](null)
(13 more lines...)
Collapse Failed ConstructorReferenceSearchTests testConstructorReferences12 History
< 1 sec
java.lang.AssertionError: expected:<2> but was:<0>
	at org.eclipse.jdt.core.groovy.tests.search.ConstructorReferenceSearchTests.testConstructorReferences12(ConstructorReferenceSearchTests.java:313)
Collapse Failed DGMInferencingTests testDGM15 History
< 1 sec
java.lang.AssertionError: Expected type not found.
Expected: java.util.Map$Entry<java.lang.String,java.lang.Integer>
Found: java.lang.Object
Declaring type: groovy.lang.Closure<V extends java.lang.Object>
ASTNode: org.codehaus.groovy.ast.expr.VariableExpression@f4ba7[variable: it]
Confidence: INFERRED

java.lang.AssertionError: 
(9 more lines...)
Collapse Failed DGMInferencingTests testDGMClosure4 History
< 1 sec
java.lang.AssertionError: Expected type not found.
Expected: java.lang.String
Found: java.lang.Object
Declaring type: Search
ASTNode: org.codehaus.groovy.ast.expr.VariableExpression@ef178[variable: val]
Confidence: INFERRED

java.lang.AssertionError: 
(9 more lines...)
Collapse Failed MethodReferenceSearchTests testExplicitPropertyGetterSearch2 History
1 sec
java.lang.AssertionError: expected:<4> but was:<0>
	at org.eclipse.jdt.core.groovy.tests.search.MethodReferenceSearchTests.testExplicitPropertyGetterSearch2(MethodReferenceSearchTests.java:526)
Collapse Failed TypeReferenceSearchTests testFindClassDeclarationWithPattern History
1 sec
java.lang.AssertionError: Expected but not found: SongTests (not open) [in SongTests.groovy [in gtunes [in src [in Project]]]]
Expected but not found: ArtistTests (not open) [in ArtistTests.groovy [in gtunes [in src [in Project]]]]
Found but not expected: class ArtistTests [in ArtistTests.groovy [in src.gtunes [in <project root> [in Project]]]]
  java.lang.Object testSomething()
Found but not expected: class SongTests [in SongTests.groovy [in src.gtunes [in <project root> [in Project]]]]
  java.lang.Object testSomething()

java.lang.AssertionError: 
(9 more lines...)
Fixed tests 6
Status Test Failing since Duration
Successful BasicGroovyBuildTests testBuildJavaHelloWorld History
Failing since build #171 (Code changes detected) < 1 sec
Successful BinarySearchTests testFieldRefInInitializer History
Failing since build #171 (Code changes detected) 1 sec
Successful ClosureInferencingTests testClosureReturnType4 History
Failing since build #171 (Code changes detected) < 1 sec
Successful ConstructorReferenceSearchTests testConstructorReferences11a History
Failing since build #171 (Code changes detected) < 1 sec
Successful ConstructorReferenceSearchTests testNewifyConstructorReferences2 History
Failing since build #171 (Code changes detected) < 1 sec
Successful ConstructorReferenceSearchTests testNewifyConstructorReferences4 History
Failing since build #171 (Code changes detected) < 1 sec

Error summary

The build generated some errors. See the full build log for more details.

Jan 08, 2020 9:34:15 PM org.apache.http.impl.execchain.RetryExec execute
INFO: I/O exception (org.apache.http.NoHttpResponseException) caught when processing request to {s}->https://download.eclipse.org:443: The target server failed to respond
Jan 08, 2020 9:34:15 PM org.apache.http.impl.execchain.RetryExec execute
INFO: Retrying request to {s}->https://download.eclipse.org:443
SWT SessionManagerDBus: Failed to connect to org.gnome.SessionManager: Failed to execute child process “dbus-launch” (No such file or directory)
SWT SessionManagerDBus: Failed to connect to org.xfce.SessionManager: Failed to execute child process “dbus-launch” (No such file or directory)
TypeInferencingVisitorWithRequestor.findMethodNode: no match found for Main.main([Qjava.lang.String;)
TypeInferencingVisitorWithRequestor.findMethodNode: no match found for Main.main([Qjava.lang.String;)
CodeSelectRequestor: Could not proceed due to null declaring type for org.codehaus.groovy.ast.expr.BinaryExpression@ecbea[org.codehaus.groovy.ast.expr.VariableExpression@ecbe3[variable: it]("in" at 1:20:  "in" )org.codehaus.groovy.ast.expr.ListExpression@ee270[]]
CodeSelectRequestor: Could not proceed due to null declaring type for org.codehaus.groovy.ast.expr.RangeExpression@ebcdd
CodeSelectRequestor: Could not proceed due to null declaring type for org.codehaus.groovy.ast.expr.RangeExpression@ebcde
TypeInferencingVisitorWithRequestor.findMethodNode: no match found for Type.x(QList<Qjava.util.Date;>;)
TypeInferencingVisitorWithRequestor.findMethodNode: no match found for Type.x(QList<Qjava.lang.Number;>;)
TypeInferencingVisitorWithRequestor.findMethodNode: no match found for Type.x(QList<Qjava.util.Date;>;)
TypeInferencingVisitorWithRequestor.findMethodNode: no match found for Type.x(QList<Qjava.lang.Number;>;)
TypeInferencingVisitorWithRequestor.findMethodNode: no match found for Type.x(QList<Qjava.lang.Number;>;)
CodeSelectRequestor: Could not proceed due to null declaring type for org.codehaus.groovy.ast.expr.ConstantExpression@e8fc6[fff]
CodeSelectRequestor: Could not proceed due to null declaring type for org.codehaus.groovy.ast.expr.ConstantExpression@e8fca[fff]
CodeSelectRequestor: Could not proceed due to null declaring type for org.codehaus.groovy.ast.expr.ConstantExpression@e8fca[fff]
Waiting for: Java indexing... 3 files to index (/Project)
Waiting for: Java indexing... 22 files to index (/Project)
Waiting for: Java indexing... 22 files to index (/Project)
Waiting for: Java indexing... 22 files to index (/Project)
Waiting for: Java indexing... 22 files to index (/Project)
Waiting for: Java indexing... 22 files to index (/Project)
Waiting for: Java indexing... 22 files to index (/Project)
Waiting for: Java indexing... 21 files to index (/Project)
Waiting for: Java indexing... 21 files to index (/Project)
Waiting for: Java indexing... 21 files to index (/Project)
Waiting for: Flushing content description cache.
Waiting for: Java indexing... 3 files to index (/Project)