Build: #173 failed

Job: Default Job failed

Stages & jobs

  1. Default Stage

Job result summary

Completed
Duration
94 minutes
Agent
bamboo-18.af.pivotal.io
Revision
b667d1198497ca0eb44540afcee18a739afcfeea b667d1198497ca0eb44540afcee18a739afcfeea
Total tests
6279
Failing since
#169 (Code changes detected – )
Fixed in
#186 (Code changes detected)

Tests

  • 6,279 tests in total
  • 6 tests failed
  • 5 failures are new
  • 36 tests were fixed
  • 140 tests were quarantined / skipped
  • 89 minutes taken in total.
New test failures 5
Status Test Duration
Collapse Failed BasicGroovyBuildTests testIncrementalCompilationTheBasics History
< 1 sec
org.junit.ComparisonFailure: unexpected recompiled units. lenExpected=2 lenActual=4 expected:<{pkg.GHello,pkg.[]Hello}> but was:<{pkg.GHello,pkg.[GHello,pkg.Hello,pkg.]Hello}>
	at org.eclipse.jdt.core.groovy.tests.builder.BasicGroovyBuildTests.testIncrementalCompilationTheBasics(BasicGroovyBuildTests.java:2066)
Collapse Failed BinarySearchTests testFieldDecl1 History
1 sec
java.lang.AssertionError: Expecting 2 matches, but found 0

java.lang.AssertionError: 
Expecting 2 matches, but found 0

	at org.eclipse.jdt.core.groovy.tests.search.BinarySearchTests.assertMatches(BinarySearchTests.java:139)
	at org.eclipse.jdt.core.groovy.tests.search.BinarySearchTests.testFieldDecl1(BinarySearchTests.java:181)
Collapse Failed ConstructorReferenceSearchTests testConstructorReferences4 History
< 1 sec
java.lang.AssertionError: expected:<2> but was:<0>
	at org.eclipse.jdt.core.groovy.tests.search.ConstructorReferenceSearchTests.testConstructorReferences4(ConstructorReferenceSearchTests.java:144)
Collapse Failed DGMInferencingTests testDGM51 History
< 1 sec
java.lang.AssertionError: Expected type not found.
Expected: java.lang.Integer
Found: java.lang.String
Declaring type: java.lang.Integer
ASTNode: org.codehaus.groovy.ast.expr.ConstantExpression@edaec[abs]
Confidence: UNKNOWN

java.lang.AssertionError: 
(9 more lines...)
Collapse Failed DGMInferencingTests testDGSMDeclaring2 History
< 1 sec
java.lang.AssertionError: Expected declaring type not found.
 Expected: org.codehaus.groovy.runtime.DefaultGroovyStaticMethods
 Found type: java.lang.String
 Found declaring type: java.util.Date
 ASTNode: org.codehaus.groovy.ast.expr.ConstantExpression@ea290[sleep]
java.lang.AssertionError: 
Expected declaring type not found.
	Expected: org.codehaus.groovy.runtime.DefaultGroovyStaticMethods
(5 more lines...)
Existing test failures 1
Status Test Failing since Duration
java.lang.AssertionError: Expected but not found: SongTests (not open) [in SongTests.groovy [in gtunes [in src [in Project]]]]
Expected but not found: ArtistTests (not open) [in ArtistTests.groovy [in gtunes [in src [in Project]]]]
Found but not expected: class ArtistTests [in ArtistTests.groovy [in src.gtunes [in <project root> [in Project]]]]
  java.lang.Object testSomething()
Found but not expected: class SongTests [in SongTests.groovy [in src.gtunes [in <project root> [in Project]]]]
  java.lang.Object testSomething()

java.lang.AssertionError: 
(9 more lines...)
Fixed tests 36
Status Test Failing since Duration
Successful SyntheticAccessorRenamingTests testAliasedAccess History
Failing since build #172 (Code changes detected) 1 sec
Successful SyntheticAccessorRenamingTests testConstructorAccess History
Failing since build #172 (Code changes detected) 1 sec
Successful SyntheticAccessorRenamingTests testFieldAndGetterAndSetter1 History
Failing since build #172 (Code changes detected) 1 sec
Successful SyntheticAccessorRenamingTests testFieldAndGetterAndSetter2 History
Failing since build #172 (Code changes detected) 1 sec
Successful SyntheticAccessorRenamingTests testFieldAndGetterAndSetter3 History
Failing since build #172 (Code changes detected) 1 sec
Successful SyntheticAccessorRenamingTests testFieldAndGetterAndSetter4 History
Failing since build #172 (Code changes detected) < 1 sec
Successful SyntheticAccessorRenamingTests testGetterOnly History
Failing since build #172 (Code changes detected) 1 sec
Successful SyntheticAccessorRenamingTests testIsserOnly History
Failing since build #172 (Code changes detected) 1 sec
Successful SyntheticAccessorRenamingTests testJavaRename1 History
Failing since build #172 (Code changes detected) 1 sec
Successful SyntheticAccessorRenamingTests testJavaRename2 History
Failing since build #172 (Code changes detected) 1 sec
Successful SyntheticAccessorRenamingTests testMultiFileRename1 History
Failing since build #172 (Code changes detected) 1 sec
Successful SyntheticAccessorRenamingTests testMultiFileRename2 History
Failing since build #172 (Code changes detected) 1 sec
Successful SyntheticAccessorRenamingTests testMultiFileRename5 History
Failing since build #172 (Code changes detected) 1 sec
Successful SyntheticAccessorRenamingTests testMultiFileRename6 History
Failing since build #172 (Code changes detected) 1 sec
Successful SyntheticAccessorRenamingTests testMultiFileRename7 History
Failing since build #172 (Code changes detected) 1 sec
Successful SyntheticAccessorRenamingTests testSetterOnly1 History
Failing since build #172 (Code changes detected) < 1 sec
Successful SyntheticAccessorRenamingTests testSetterOnly2 History
Failing since build #172 (Code changes detected) 1 sec
Successful SyntheticAccessorRenamingTests testSetterOnly2a History
Failing since build #172 (Code changes detected) 1 sec
Successful SyntheticAccessorRenamingTests testSingleFileRename1 History
Failing since build #172 (Code changes detected) 1 sec
Successful SyntheticAccessorRenamingTests testSingleFileRename2 History
Failing since build #172 (Code changes detected) 1 sec
Successful SyntheticAccessorRenamingTests testSingleFileRename3 History
Failing since build #172 (Code changes detected) 1 sec
Successful SyntheticAccessorRenamingTests testSingleFileRename4 History
Failing since build #172 (Code changes detected) 1 sec
Successful SyntheticAccessorRenamingTests testStaticGetterOnly1 History
Failing since build #172 (Code changes detected) 2 secs
Successful SyntheticAccessorRenamingTests testStaticGetterOnly2 History
Failing since build #172 (Code changes detected) 1 sec
Successful SyntheticAccessorRenamingTests testStaticIsserOnly1 History
Failing since build #172 (Code changes detected) 1 sec
Successful SyntheticAccessorRenamingTests testStaticIsserOnly2 History
Failing since build #172 (Code changes detected) 1 sec
Successful SyntheticAccessorRenamingTests testStaticSetterOnly1 History
Failing since build #172 (Code changes detected) 1 sec
Successful SyntheticAccessorRenamingTests testStaticSetterOnly2 History
Failing since build #172 (Code changes detected) 1 sec
Successful SyntheticAccessorRenamingTests testStaticSetterOnly4 History
Failing since build #172 (Code changes detected) 1 sec
Successful SyntheticAccessorRenamingTests testStaticSetterOnly4a History
Failing since build #172 (Code changes detected) 1 sec
Successful SyntheticAccessorRenamingTests testSubclassAccess1 History
Failing since build #172 (Code changes detected) 5 secs
Successful SyntheticAccessorRenamingTests testSubclassAccess2 History
Failing since build #172 (Code changes detected) 1 sec
Successful ConstructorReferenceSearchTests testConstructorReferences12 History
Failing since build #172 (Code changes detected) < 1 sec
Successful DGMInferencingTests testDGM15 History
Failing since build #172 (Code changes detected) < 1 sec
Successful DGMInferencingTests testDGMClosure4 History
Failing since build #172 (Code changes detected) < 1 sec
Successful MethodReferenceSearchTests testExplicitPropertyGetterSearch2 History
Failing since build #172 (Code changes detected) 1 sec

Error summary

The build generated some errors. See the full build log for more details.

Jan 09, 2020 5:03:29 PM org.apache.http.impl.execchain.RetryExec execute
INFO: I/O exception (org.apache.http.NoHttpResponseException) caught when processing request to {s}->https://download.eclipse.org:443: The target server failed to respond
Jan 09, 2020 5:03:29 PM org.apache.http.impl.execchain.RetryExec execute
INFO: Retrying request to {s}->https://download.eclipse.org:443
SWT SessionManagerDBus: Failed to connect to org.gnome.SessionManager: Failed to execute child process “dbus-launch” (No such file or directory)
SWT SessionManagerDBus: Failed to connect to org.xfce.SessionManager: Failed to execute child process “dbus-launch” (No such file or directory)
TypeInferencingVisitorWithRequestor.findMethodNode: no match found for Main.main([Qjava.lang.String;)
TypeInferencingVisitorWithRequestor.findMethodNode: no match found for Main.main([Qjava.lang.String;)
CodeSelectRequestor: Could not proceed due to null declaring type for org.codehaus.groovy.ast.expr.BinaryExpression@ecbea[org.codehaus.groovy.ast.expr.VariableExpression@ecbe3[variable: it]("in" at 1:20:  "in" )org.codehaus.groovy.ast.expr.ListExpression@ee270[]]
CodeSelectRequestor: Could not proceed due to null declaring type for org.codehaus.groovy.ast.expr.RangeExpression@ebcdd
CodeSelectRequestor: Could not proceed due to null declaring type for org.codehaus.groovy.ast.expr.RangeExpression@ebcde
TypeInferencingVisitorWithRequestor.findMethodNode: no match found for Type.x(QList<Qjava.util.Date;>;)
TypeInferencingVisitorWithRequestor.findMethodNode: no match found for Type.x(QList<Qjava.lang.Number;>;)
TypeInferencingVisitorWithRequestor.findMethodNode: no match found for Type.x(QList<Qjava.lang.Number;>;)
TypeInferencingVisitorWithRequestor.findMethodNode: no match found for Type.x(QList<Qjava.util.Date;>;)
TypeInferencingVisitorWithRequestor.findMethodNode: no match found for Type.x(QList<Qjava.lang.Number;>;)
TypeInferencingVisitorWithRequestor.findMethodNode: no match found for Type.x(QList<Qjava.lang.Number;>;)
CodeSelectRequestor: Could not proceed due to null declaring type for org.codehaus.groovy.ast.expr.ConstantExpression@e8fc6[fff]
CodeSelectRequestor: Could not proceed due to null declaring type for org.codehaus.groovy.ast.expr.ConstantExpression@e8fca[fff]
CodeSelectRequestor: Could not proceed due to null declaring type for org.codehaus.groovy.ast.expr.ConstantExpression@e8fca[fff]
Waiting for: Java indexing... 4 files to index (/Project)
Waiting for: Building workspace
Waiting for: Java indexing... 22 files to index (/Project)
Waiting for: Java indexing... 22 files to index (/Project)
Waiting for: Java indexing... 22 files to index (/Project)
Waiting for: Java indexing... 22 files to index (/Project)
Waiting for: Java indexing... 22 files to index (/Project)
Waiting for: Java indexing... 22 files to index (/Project)
Waiting for: Java indexing... 21 files to index (/Project)
Waiting for: Java indexing... 21 files to index (/Project)
Waiting for: Flushing content description cache.
Waiting for: Java indexing... 21 files to index (/Project)
Waiting for: Java indexing... 3 files to index (/Project)