Build: #176 failed

Job: Default Job failed

Stages & jobs

  1. Default Stage

Build log

The build generated 50,801 lines of output.The output is too long and has been truncated to the last 1,000 lines. Download or view full build log

11-Jan-2020 05:24:40 testStaticMethodOverloads1(org.eclipse.jdt.core.groovy.tests.search.GenericInferencingTests)  Time elapsed: 0.241 s
11-Jan-2020 05:24:40 testStaticMethodOverloads2(org.eclipse.jdt.core.groovy.tests.search.GenericInferencingTests)  Time elapsed: 0.194 s
11-Jan-2020 05:24:40 testStaticMethodOverloads3(org.eclipse.jdt.core.groovy.tests.search.GenericInferencingTests)  Time elapsed: 0.187 s
11-Jan-2020 05:24:40 testStaticMethodOverloads4(org.eclipse.jdt.core.groovy.tests.search.GenericInferencingTests)  Time elapsed: 0.172 s
11-Jan-2020 05:24:40 testStaticMethodOverloads5(org.eclipse.jdt.core.groovy.tests.search.GenericInferencingTests)  Time elapsed: 0.212 s
11-Jan-2020 05:24:40 testStaticMethodOverloads6(org.eclipse.jdt.core.groovy.tests.search.GenericInferencingTests)  Time elapsed: 0.219 s
11-Jan-2020 05:24:40 testStaticMethodOverloads7(org.eclipse.jdt.core.groovy.tests.search.GenericInferencingTests)  Time elapsed: 0.18 s
11-Jan-2020 05:24:40 testStaticMethodOverloads8(org.eclipse.jdt.core.groovy.tests.search.GenericInferencingTests)  Time elapsed: 0.181 s
11-Jan-2020 05:24:40 testStaticMethodOverloads9(org.eclipse.jdt.core.groovy.tests.search.GenericInferencingTests)  Time elapsed: 0.187 s
11-Jan-2020 05:24:40 testNestedGenerics1(org.eclipse.jdt.core.groovy.tests.search.GenericInferencingTests)  Time elapsed: 0.201 s
11-Jan-2020 05:24:40 testNestedGenerics2(org.eclipse.jdt.core.groovy.tests.search.GenericInferencingTests)  Time elapsed: 0.237 s
11-Jan-2020 05:24:40 testNestedGenerics3(org.eclipse.jdt.core.groovy.tests.search.GenericInferencingTests)  Time elapsed: 0.215 s
11-Jan-2020 05:24:40 testNestedGenerics4(org.eclipse.jdt.core.groovy.tests.search.GenericInferencingTests)  Time elapsed: 0.214 s
11-Jan-2020 05:24:40 testNestedGenerics5(org.eclipse.jdt.core.groovy.tests.search.GenericInferencingTests)  Time elapsed: 0.25 s
11-Jan-2020 05:24:40 testNestedGenerics6(org.eclipse.jdt.core.groovy.tests.search.GenericInferencingTests)  Time elapsed: 0.241 s
11-Jan-2020 05:24:40 testNestedGenerics7(org.eclipse.jdt.core.groovy.tests.search.GenericInferencingTests)  Time elapsed: 0.258 s
11-Jan-2020 05:24:40 testNestedGenerics8(org.eclipse.jdt.core.groovy.tests.search.GenericInferencingTests)  Time elapsed: 0.215 s
11-Jan-2020 05:24:40 testStaticMethod10(org.eclipse.jdt.core.groovy.tests.search.GenericInferencingTests)  Time elapsed: 0.381 s
11-Jan-2020 05:24:40 testStaticMethod11(org.eclipse.jdt.core.groovy.tests.search.GenericInferencingTests)  Time elapsed: 0.257 s
11-Jan-2020 05:24:40 testMethod1(org.eclipse.jdt.core.groovy.tests.search.GenericInferencingTests)  Time elapsed: 0.344 s
11-Jan-2020 05:24:40 testMethod2(org.eclipse.jdt.core.groovy.tests.search.GenericInferencingTests)  Time elapsed: 0.204 s
11-Jan-2020 05:24:40 testMethod3(org.eclipse.jdt.core.groovy.tests.search.GenericInferencingTests)  Time elapsed: 0.238 s
11-Jan-2020 05:24:40 testMethod4(org.eclipse.jdt.core.groovy.tests.search.GenericInferencingTests)  Time elapsed: 0.305 s
11-Jan-2020 05:24:40 testGetClass1(org.eclipse.jdt.core.groovy.tests.search.GenericInferencingTests)  Time elapsed: 0.198 s
11-Jan-2020 05:24:40 testGetClass2(org.eclipse.jdt.core.groovy.tests.search.GenericInferencingTests)  Time elapsed: 0.229 s
11-Jan-2020 05:24:40 testGetClass3(org.eclipse.jdt.core.groovy.tests.search.GenericInferencingTests)  Time elapsed: 0.244 s
11-Jan-2020 05:24:40 testCircularReference(org.eclipse.jdt.core.groovy.tests.search.GenericInferencingTests)  Time elapsed: 0.243 s
11-Jan-2020 05:24:40 testForLoop1(org.eclipse.jdt.core.groovy.tests.search.GenericInferencingTests)  Time elapsed: 0.193 s
11-Jan-2020 05:24:40 testForLoop2(org.eclipse.jdt.core.groovy.tests.search.GenericInferencingTests)  Time elapsed: 0.299 s
11-Jan-2020 05:24:40 testForLoop3(org.eclipse.jdt.core.groovy.tests.search.GenericInferencingTests)  Time elapsed: 0.239 s
11-Jan-2020 05:24:40 testForLoop4(org.eclipse.jdt.core.groovy.tests.search.GenericInferencingTests)  Time elapsed: 0.186 s
11-Jan-2020 05:24:40 testForLoop5(org.eclipse.jdt.core.groovy.tests.search.GenericInferencingTests)  Time elapsed: 0.197 s
11-Jan-2020 05:24:40 testForLoop6(org.eclipse.jdt.core.groovy.tests.search.GenericInferencingTests)  Time elapsed: 0.183 s
11-Jan-2020 05:24:40 testForLoop7(org.eclipse.jdt.core.groovy.tests.search.GenericInferencingTests)  Time elapsed: 0.187 s
11-Jan-2020 05:24:40 testForLoop8(org.eclipse.jdt.core.groovy.tests.search.GenericInferencingTests)  Time elapsed: 0.199 s
11-Jan-2020 05:24:40 testForLoop9(org.eclipse.jdt.core.groovy.tests.search.GenericInferencingTests)  Time elapsed: 0.298 s
11-Jan-2020 05:24:40 testMapOfMaps(org.eclipse.jdt.core.groovy.tests.search.GenericInferencingTests)  Time elapsed: 0.18 s
11-Jan-2020 05:24:40 testList10(org.eclipse.jdt.core.groovy.tests.search.GenericInferencingTests)  Time elapsed: 0.203 s
11-Jan-2020 05:24:40 testList11(org.eclipse.jdt.core.groovy.tests.search.GenericInferencingTests)  Time elapsed: 0.208 s
11-Jan-2020 05:24:40 testList12(org.eclipse.jdt.core.groovy.tests.search.GenericInferencingTests)  Time elapsed: 0.189 s
11-Jan-2020 05:24:40 testList13(org.eclipse.jdt.core.groovy.tests.search.GenericInferencingTests)  Time elapsed: 0.217 s
11-Jan-2020 05:24:40 testForLoop11(org.eclipse.jdt.core.groovy.tests.search.GenericInferencingTests)  Time elapsed: 0.234 s
11-Jan-2020 05:24:40 testForLoop2a(org.eclipse.jdt.core.groovy.tests.search.GenericInferencingTests)  Time elapsed: 0.204 s
11-Jan-2020 05:24:40 testRange1(org.eclipse.jdt.core.groovy.tests.search.GenericInferencingTests)  Time elapsed: 0.209 s
11-Jan-2020 05:24:40 testRange2(org.eclipse.jdt.core.groovy.tests.search.GenericInferencingTests)  Time elapsed: 0.285 s
11-Jan-2020 05:24:40 testClosure1(org.eclipse.jdt.core.groovy.tests.search.GenericInferencingTests)  Time elapsed: 0.224 s
11-Jan-2020 05:24:40 testClosure2(org.eclipse.jdt.core.groovy.tests.search.GenericInferencingTests)  Time elapsed: 0.202 s
11-Jan-2020 05:24:40 testClosure3(org.eclipse.jdt.core.groovy.tests.search.GenericInferencingTests)  Time elapsed: 0.196 s
11-Jan-2020 05:24:40 testClosure4(org.eclipse.jdt.core.groovy.tests.search.GenericInferencingTests)  Time elapsed: 0.186 s
11-Jan-2020 05:24:40 testMapOfList1(org.eclipse.jdt.core.groovy.tests.search.GenericInferencingTests)  Time elapsed: 0.213 s
11-Jan-2020 05:24:40 testMapOfList2(org.eclipse.jdt.core.groovy.tests.search.GenericInferencingTests)  Time elapsed: 0.237 s
11-Jan-2020 05:24:40 testMapOfList3(org.eclipse.jdt.core.groovy.tests.search.GenericInferencingTests)  Time elapsed: 0.188 s
11-Jan-2020 05:24:40 testMapOfList4(org.eclipse.jdt.core.groovy.tests.search.GenericInferencingTests)  Time elapsed: 0.207 s
11-Jan-2020 05:24:40 testMapOfList5(org.eclipse.jdt.core.groovy.tests.search.GenericInferencingTests)  Time elapsed: 0.191 s
11-Jan-2020 05:24:40 testMapOfList6(org.eclipse.jdt.core.groovy.tests.search.GenericInferencingTests)  Time elapsed: 0.308 s
11-Jan-2020 05:24:40 testMapOfList7(org.eclipse.jdt.core.groovy.tests.search.GenericInferencingTests)  Time elapsed: 0.192 s
11-Jan-2020 05:24:40 testGenericsMapper(org.eclipse.jdt.core.groovy.tests.search.GenericsMappingTests)  Time elapsed: 0.088 s
11-Jan-2020 05:24:40 testCompileStatic10(org.eclipse.jdt.core.groovy.tests.search.Groovy20InferencingTests)  Time elapsed: 0.233 s
11-Jan-2020 05:24:40 testCompileStatic11(org.eclipse.jdt.core.groovy.tests.search.Groovy20InferencingTests)  Time elapsed: 0.334 s
11-Jan-2020 05:24:40 testCompileStatic12(org.eclipse.jdt.core.groovy.tests.search.Groovy20InferencingTests)  Time elapsed: 0.246 s
11-Jan-2020 05:24:40 testCompileStatic13(org.eclipse.jdt.core.groovy.tests.search.Groovy20InferencingTests)  Time elapsed: 0.311 s
11-Jan-2020 05:24:40 testCompileStatic14(org.eclipse.jdt.core.groovy.tests.search.Groovy20InferencingTests)  Time elapsed: 0.293 s
11-Jan-2020 05:24:40 testCompileStatic15(org.eclipse.jdt.core.groovy.tests.search.Groovy20InferencingTests)  Time elapsed: 0.281 s
11-Jan-2020 05:24:40 testCompileStatic16(org.eclipse.jdt.core.groovy.tests.search.Groovy20InferencingTests)  Time elapsed: 0.298 s
11-Jan-2020 05:24:40 testCompileStatic17(org.eclipse.jdt.core.groovy.tests.search.Groovy20InferencingTests)  Time elapsed: 0.235 s
11-Jan-2020 05:24:40 testCompileStatic1(org.eclipse.jdt.core.groovy.tests.search.Groovy20InferencingTests)  Time elapsed: 0.229 s
11-Jan-2020 05:24:40 testCompileStatic2(org.eclipse.jdt.core.groovy.tests.search.Groovy20InferencingTests)  Time elapsed: 0.194 s
11-Jan-2020 05:24:40 testCompileStatic3(org.eclipse.jdt.core.groovy.tests.search.Groovy20InferencingTests)  Time elapsed: 0.206 s
11-Jan-2020 05:24:40 testCompileStatic4(org.eclipse.jdt.core.groovy.tests.search.Groovy20InferencingTests)  Time elapsed: 0.181 s
11-Jan-2020 05:24:40 testCompileStatic5(org.eclipse.jdt.core.groovy.tests.search.Groovy20InferencingTests)  Time elapsed: 0.248 s
11-Jan-2020 05:24:40 testCompileStatic6(org.eclipse.jdt.core.groovy.tests.search.Groovy20InferencingTests)  Time elapsed: 0.213 s
11-Jan-2020 05:24:40 testCompileStatic7(org.eclipse.jdt.core.groovy.tests.search.Groovy20InferencingTests)  Time elapsed: 0.3 s
11-Jan-2020 05:24:40 testCompileStatic8(org.eclipse.jdt.core.groovy.tests.search.Groovy20InferencingTests)  Time elapsed: 0.25 s
11-Jan-2020 05:24:40 testCompileStatic9(org.eclipse.jdt.core.groovy.tests.search.Groovy20InferencingTests)  Time elapsed: 0.189 s
11-Jan-2020 05:24:40 testTypeChecked1(org.eclipse.jdt.core.groovy.tests.search.Groovy20InferencingTests)  Time elapsed: 0.218 s
11-Jan-2020 05:24:40 testTypeChecked2(org.eclipse.jdt.core.groovy.tests.search.Groovy20InferencingTests)  Time elapsed: 0.214 s
11-Jan-2020 05:24:40 testTypeChecked3(org.eclipse.jdt.core.groovy.tests.search.Groovy20InferencingTests)  Time elapsed: 0.234 s
11-Jan-2020 05:24:40 testTypeChecked4(org.eclipse.jdt.core.groovy.tests.search.Groovy20InferencingTests)  Time elapsed: 0.201 s
11-Jan-2020 05:24:40 testTypeChecked5(org.eclipse.jdt.core.groovy.tests.search.Groovy20InferencingTests)  Time elapsed: 0.199 s
11-Jan-2020 05:24:40 testTypeChecked6(org.eclipse.jdt.core.groovy.tests.search.Groovy20InferencingTests)  Time elapsed: 0.205 s
11-Jan-2020 05:24:40 testTypeChecked7(org.eclipse.jdt.core.groovy.tests.search.Groovy20InferencingTests)  Time elapsed: 0.211 s
11-Jan-2020 05:24:40 testTypeChecked8(org.eclipse.jdt.core.groovy.tests.search.Groovy20InferencingTests)  Time elapsed: 0.2 s
11-Jan-2020 05:24:40 testDelegatesToResolveStrategy2(org.eclipse.jdt.core.groovy.tests.search.Groovy21InferencingTests)  Time elapsed: 0.278 s
11-Jan-2020 05:24:40 testDelegatesToResolveStrategy3(org.eclipse.jdt.core.groovy.tests.search.Groovy21InferencingTests)  Time elapsed: 0.25 s
11-Jan-2020 05:24:40 testDelegatesToResolveStrategy4(org.eclipse.jdt.core.groovy.tests.search.Groovy21InferencingTests)  Time elapsed: 1.427 s
11-Jan-2020 05:24:40 testDelegatesToTarget2a(org.eclipse.jdt.core.groovy.tests.search.Groovy21InferencingTests)  Time elapsed: 0.259 s
11-Jan-2020 05:24:40 testDelegatesToTypeName3a(org.eclipse.jdt.core.groovy.tests.search.Groovy21InferencingTests)  Time elapsed: 0.227 s
11-Jan-2020 05:24:40 testDelegatesToTypeName3b(org.eclipse.jdt.core.groovy.tests.search.Groovy21InferencingTests)  Time elapsed: 0.243 s
11-Jan-2020 05:24:40 testTypeCheckingExtension(org.eclipse.jdt.core.groovy.tests.search.Groovy21InferencingTests)  Time elapsed: 0.716 s
11-Jan-2020 05:24:40 testDelegatesToTarget1(org.eclipse.jdt.core.groovy.tests.search.Groovy21InferencingTests)  Time elapsed: 0.283 s
11-Jan-2020 05:24:40 testDelegatesToTarget2(org.eclipse.jdt.core.groovy.tests.search.Groovy21InferencingTests)  Time elapsed: 0.306 s
11-Jan-2020 05:24:40 testDelegatesToTarget3(org.eclipse.jdt.core.groovy.tests.search.Groovy21InferencingTests)  Time elapsed: 0.251 s
11-Jan-2020 05:24:40 testDelegatesToTarget4(org.eclipse.jdt.core.groovy.tests.search.Groovy21InferencingTests)  Time elapsed: 0.343 s
11-Jan-2020 05:24:40 testDelegatesToTarget5(org.eclipse.jdt.core.groovy.tests.search.Groovy21InferencingTests)  Time elapsed: 0.374 s
11-Jan-2020 05:24:40 testDelegatesToTarget6(org.eclipse.jdt.core.groovy.tests.search.Groovy21InferencingTests)  Time elapsed: 0.3 s
11-Jan-2020 05:24:40 testDelegatesToValue2(org.eclipse.jdt.core.groovy.tests.search.Groovy21InferencingTests)  Time elapsed: 0.287 s
11-Jan-2020 05:24:40 testDelegatesToValue3(org.eclipse.jdt.core.groovy.tests.search.Groovy21InferencingTests)  Time elapsed: 0.22 s
11-Jan-2020 05:24:40 testDelegatesToValue4(org.eclipse.jdt.core.groovy.tests.search.Groovy21InferencingTests)  Time elapsed: 0.215 s
11-Jan-2020 05:24:40 testDelegatesToValue5(org.eclipse.jdt.core.groovy.tests.search.Groovy21InferencingTests)  Time elapsed: 0.258 s
11-Jan-2020 05:24:40 testDelegatesToValue6(org.eclipse.jdt.core.groovy.tests.search.Groovy21InferencingTests)  Time elapsed: 0.22 s
11-Jan-2020 05:24:40 testDelegatesToTypeName1(org.eclipse.jdt.core.groovy.tests.search.Groovy21InferencingTests)  Time elapsed: 0.221 s
11-Jan-2020 05:24:40 testDelegatesToTypeName2(org.eclipse.jdt.core.groovy.tests.search.Groovy21InferencingTests)  Time elapsed: 0.224 s
11-Jan-2020 05:24:40 testDelegatesToTypeName3(org.eclipse.jdt.core.groovy.tests.search.Groovy21InferencingTests)  Time elapsed: 0.258 s
11-Jan-2020 05:24:40 testDelegatesToValue(org.eclipse.jdt.core.groovy.tests.search.Groovy21InferencingTests)  Time elapsed: 0.24 s
11-Jan-2020 05:24:40 testEnumOverrides(org.eclipse.jdt.core.groovy.tests.search.Groovy21InferencingTests)  Time elapsed: 0.225 s
11-Jan-2020 05:24:40 testEnumOverrides2(org.eclipse.jdt.core.groovy.tests.search.Groovy21InferencingTests)  Time elapsed: 0.243 s
11-Jan-2020 05:24:40 org.eclipse.jdt.core.groovy.tests.search.Groovy25InferencingTests skipped
11-Jan-2020 05:24:40 testFieldAndPropertyWithSameName(org.eclipse.jdt.core.groovy.tests.search.InferencingTests)  Time elapsed: 0.208 s
11-Jan-2020 05:24:40 testObjectMethodOnInterface(org.eclipse.jdt.core.groovy.tests.search.InferencingTests)  Time elapsed: 0.221 s
11-Jan-2020 05:24:40 testLocalWithInitializer1(org.eclipse.jdt.core.groovy.tests.search.InferencingTests)  Time elapsed: 0.245 s
11-Jan-2020 05:24:40 testLocalWithInitializer2(org.eclipse.jdt.core.groovy.tests.search.InferencingTests)  Time elapsed: 0.202 s
11-Jan-2020 05:24:40 testLocalWithInitializer3(org.eclipse.jdt.core.groovy.tests.search.InferencingTests)  Time elapsed: 0.21 s
11-Jan-2020 05:24:40 testLocalWithInitializer4(org.eclipse.jdt.core.groovy.tests.search.InferencingTests)  Time elapsed: 0.183 s
11-Jan-2020 05:24:40 testLocalWithInitializer5(org.eclipse.jdt.core.groovy.tests.search.InferencingTests)  Time elapsed: 0.186 s
11-Jan-2020 05:24:40 testNothingIsUnknown(org.eclipse.jdt.core.groovy.tests.search.InferencingTests)  Time elapsed: 0.244 s
11-Jan-2020 05:24:40 testInnerClass1(org.eclipse.jdt.core.groovy.tests.search.InferencingTests)  Time elapsed: 0.192 s
11-Jan-2020 05:24:40 testInnerClass2(org.eclipse.jdt.core.groovy.tests.search.InferencingTests)  Time elapsed: 0.216 s
11-Jan-2020 05:24:40 testInnerClass3(org.eclipse.jdt.core.groovy.tests.search.InferencingTests)  Time elapsed: 0.19 s
11-Jan-2020 05:24:40 testInnerClass4(org.eclipse.jdt.core.groovy.tests.search.InferencingTests)  Time elapsed: 0.199 s
11-Jan-2020 05:24:40 testInnerClass5(org.eclipse.jdt.core.groovy.tests.search.InferencingTests)  Time elapsed: 0.085 s
11-Jan-2020 05:24:40 testInnerClass6(org.eclipse.jdt.core.groovy.tests.search.InferencingTests)  Time elapsed: 0.135 s
11-Jan-2020 05:24:40 testInnerClass7(org.eclipse.jdt.core.groovy.tests.search.InferencingTests)  Time elapsed: 0.363 s
11-Jan-2020 05:24:40 testInnerClass8(org.eclipse.jdt.core.groovy.tests.search.InferencingTests)  Time elapsed: 0.361 s
11-Jan-2020 05:24:40 testInnerClass9(org.eclipse.jdt.core.groovy.tests.search.InferencingTests)  Time elapsed: 0.274 s
11-Jan-2020 05:24:40 testMethodOverloadsArgumentMatching1(org.eclipse.jdt.core.groovy.tests.search.InferencingTests)  Time elapsed: 0.229 s
11-Jan-2020 05:24:40 testMethodOverloadsArgumentMatching2(org.eclipse.jdt.core.groovy.tests.search.InferencingTests)  Time elapsed: 0.224 s
11-Jan-2020 05:24:40 testMethodOverloadsArgumentMatching3(org.eclipse.jdt.core.groovy.tests.search.InferencingTests)  Time elapsed: 0.2 s
11-Jan-2020 05:24:40 testMethodOverloadsArgumentMatching4(org.eclipse.jdt.core.groovy.tests.search.InferencingTests)  Time elapsed: 0.205 s
11-Jan-2020 05:24:40 testMethodOverloadsArgumentMatching5(org.eclipse.jdt.core.groovy.tests.search.InferencingTests)  Time elapsed: 0.227 s
11-Jan-2020 05:24:40 testMethodOverloadsArgumentMatching6(org.eclipse.jdt.core.groovy.tests.search.InferencingTests)  Time elapsed: 0.209 s
11-Jan-2020 05:24:40 testMethodOverloadsArgumentMatching7(org.eclipse.jdt.core.groovy.tests.search.InferencingTests)  Time elapsed: 0.221 s
11-Jan-2020 05:24:40 testMethodOverloadsArgumentMatching8(org.eclipse.jdt.core.groovy.tests.search.InferencingTests)  Time elapsed: 0.199 s
11-Jan-2020 05:24:40 testMethodOverloadsArgumentMatching9(org.eclipse.jdt.core.groovy.tests.search.InferencingTests)  Time elapsed: 0.225 s
11-Jan-2020 05:24:40 testBoolean1(org.eclipse.jdt.core.groovy.tests.search.InferencingTests)  Time elapsed: 0.226 s
11-Jan-2020 05:24:40 testBoolean2(org.eclipse.jdt.core.groovy.tests.search.InferencingTests)  Time elapsed: 0.199 s
11-Jan-2020 05:24:40 testBoolean3(org.eclipse.jdt.core.groovy.tests.search.InferencingTests)  Time elapsed: 0.193 s
11-Jan-2020 05:24:40 testBoolean4(org.eclipse.jdt.core.groovy.tests.search.InferencingTests)  Time elapsed: 0.193 s
11-Jan-2020 05:24:40 testBoolean5(org.eclipse.jdt.core.groovy.tests.search.InferencingTests)  Time elapsed: 0.23 s
11-Jan-2020 05:24:40 testBoolean6(org.eclipse.jdt.core.groovy.tests.search.InferencingTests)  Time elapsed: 0.188 s
11-Jan-2020 05:24:40 testBoolean7(org.eclipse.jdt.core.groovy.tests.search.InferencingTests)  Time elapsed: 0.238 s
11-Jan-2020 05:24:40 testDeclarationAtBeginningOfMethod(org.eclipse.jdt.core.groovy.tests.search.InferencingTests)  Time elapsed: 0.208 s
11-Jan-2020 05:24:40 testLocalTypeAndDefaultImportCollision(org.eclipse.jdt.core.groovy.tests.search.InferencingTests)  Time elapsed: 0.252 s  <<< FAILURE!
11-Jan-2020 05:24:40 java.lang.AssertionError:
11-Jan-2020 05:24:40 Expected type not found.
11-Jan-2020 05:24:40 Expected: domain.Calendar
11-Jan-2020 05:24:40 Found: java.lang.String
11-Jan-2020 05:24:40 Declaring type: Search
11-Jan-2020 05:24:40 ASTNode: org.codehaus.groovy.ast.expr.VariableExpression@e9ecc[variable: cal]
11-Jan-2020 05:24:40 Confidence: INFERRED
11-Jan-2020 05:24:40
11-Jan-2020 05:24:40         at org.eclipse.jdt.core.groovy.tests.search.InferencingTests.testLocalTypeAndDefaultImportCollision(InferencingTests.java:3175)
11-Jan-2020 05:24:40
11-Jan-2020 05:24:40 testTernaryInitializer(org.eclipse.jdt.core.groovy.tests.search.InferencingTests)  Time elapsed: 0.2 s
11-Jan-2020 05:24:40 testSuperFieldReference1a(org.eclipse.jdt.core.groovy.tests.search.InferencingTests)  Time elapsed: 0.198 s
11-Jan-2020 05:24:40 testSuperFieldReference1b(org.eclipse.jdt.core.groovy.tests.search.InferencingTests)  Time elapsed: 0.205 s
11-Jan-2020 05:24:40 testSuperFieldReference1c(org.eclipse.jdt.core.groovy.tests.search.InferencingTests)  Time elapsed: 0.194 s
11-Jan-2020 05:24:40 testSuperFieldReference1d(org.eclipse.jdt.core.groovy.tests.search.InferencingTests)  Time elapsed: 0.208 s
11-Jan-2020 05:24:40 testSuperFieldReference2a(org.eclipse.jdt.core.groovy.tests.search.InferencingTests)  Time elapsed: 0.218 s
11-Jan-2020 05:24:40 testSuperFieldReference2b(org.eclipse.jdt.core.groovy.tests.search.InferencingTests)  Time elapsed: 0.201 s
11-Jan-2020 05:24:40 testSuperFieldReference2c(org.eclipse.jdt.core.groovy.tests.search.InferencingTests)  Time elapsed: 0.227 s
11-Jan-2020 05:24:40 testSuperFieldReference2d(org.eclipse.jdt.core.groovy.tests.search.InferencingTests)  Time elapsed: 0.213 s
11-Jan-2020 05:24:40 testSuperFieldReference3a(org.eclipse.jdt.core.groovy.tests.search.InferencingTests)  Time elapsed: 0.21 s
11-Jan-2020 05:24:40 testSuperFieldReference3b(org.eclipse.jdt.core.groovy.tests.search.InferencingTests)  Time elapsed: 0.335 s
11-Jan-2020 05:24:40 testSuperFieldReference3c(org.eclipse.jdt.core.groovy.tests.search.InferencingTests)  Time elapsed: 0.213 s
11-Jan-2020 05:24:40 testSuperFieldReference3d(org.eclipse.jdt.core.groovy.tests.search.InferencingTests)  Time elapsed: 0.354 s
11-Jan-2020 05:24:40 testSuperFieldReference5a(org.eclipse.jdt.core.groovy.tests.search.InferencingTests)  Time elapsed: 0.208 s
11-Jan-2020 05:24:40 testSuperFieldReference5b(org.eclipse.jdt.core.groovy.tests.search.InferencingTests)  Time elapsed: 0.211 s
11-Jan-2020 05:24:40 testSpecialConstructor1(org.eclipse.jdt.core.groovy.tests.search.InferencingTests)  Time elapsed: 0.142 s
11-Jan-2020 05:24:40 testSpecialConstructor2(org.eclipse.jdt.core.groovy.tests.search.InferencingTests)  Time elapsed: 0.172 s
11-Jan-2020 05:24:40 testInnerClass10(org.eclipse.jdt.core.groovy.tests.search.InferencingTests)  Time elapsed: 0.291 s
11-Jan-2020 05:24:40 testInnerClass11(org.eclipse.jdt.core.groovy.tests.search.InferencingTests)  Time elapsed: 0.262 s
11-Jan-2020 05:24:40 testMultiDecl10(org.eclipse.jdt.core.groovy.tests.search.InferencingTests)  Time elapsed: 0.243 s
11-Jan-2020 05:24:40 testMultiDecl11(org.eclipse.jdt.core.groovy.tests.search.InferencingTests)  Time elapsed: 0.242 s
11-Jan-2020 05:24:40 testMultiDecl12(org.eclipse.jdt.core.groovy.tests.search.InferencingTests)  Time elapsed: 1.157 s
11-Jan-2020 05:24:40 testMultiDecl13(org.eclipse.jdt.core.groovy.tests.search.InferencingTests)  Time elapsed: 0.244 s
11-Jan-2020 05:24:40 testAsExpression1(org.eclipse.jdt.core.groovy.tests.search.InferencingTests)  Time elapsed: 0.215 s
11-Jan-2020 05:24:40 testAsExpression2(org.eclipse.jdt.core.groovy.tests.search.InferencingTests)  Time elapsed: 0.204 s
11-Jan-2020 05:24:40 testSuperClassMethod1(org.eclipse.jdt.core.groovy.tests.search.InferencingTests)  Time elapsed: 0.217 s
11-Jan-2020 05:24:40 testSuperClassMethod2(org.eclipse.jdt.core.groovy.tests.search.InferencingTests)  Time elapsed: 0.226 s
11-Jan-2020 05:24:40 testSuperClassMethod3(org.eclipse.jdt.core.groovy.tests.search.InferencingTests)  Time elapsed: 0.242 s
11-Jan-2020 05:24:40 testSuperClassMethod4(org.eclipse.jdt.core.groovy.tests.search.InferencingTests)  Time elapsed: 0.266 s
11-Jan-2020 05:24:40 testSuperClassMethod5(org.eclipse.jdt.core.groovy.tests.search.InferencingTests)  Time elapsed: 0.241 s
11-Jan-2020 05:24:40 testElvisInitializer(org.eclipse.jdt.core.groovy.tests.search.InferencingTests)  Time elapsed: 0.197 s
11-Jan-2020 05:24:40 testSuperPropertyReference1(org.eclipse.jdt.core.groovy.tests.search.InferencingTests)  Time elapsed: 0.946 s
11-Jan-2020 05:24:40 testSuperPropertyReference2(org.eclipse.jdt.core.groovy.tests.search.InferencingTests)  Time elapsed: 0.21 s
11-Jan-2020 05:24:40 testSuperPropertyReference3(org.eclipse.jdt.core.groovy.tests.search.InferencingTests)  Time elapsed: 0.225 s
11-Jan-2020 05:24:40 testSuperPropertyReference4(org.eclipse.jdt.core.groovy.tests.search.InferencingTests)  Time elapsed: 0.235 s
11-Jan-2020 05:24:40 testSuperPropertyReference5(org.eclipse.jdt.core.groovy.tests.search.InferencingTests)  Time elapsed: 0.191 s
11-Jan-2020 05:24:40 testRangeExpression1(org.eclipse.jdt.core.groovy.tests.search.InferencingTests)  Time elapsed: 2.045 s
11-Jan-2020 05:24:40 testRangeExpression2(org.eclipse.jdt.core.groovy.tests.search.InferencingTests)  Time elapsed: 0.218 s
11-Jan-2020 05:24:40 testRangeExpression3(org.eclipse.jdt.core.groovy.tests.search.InferencingTests)  Time elapsed: 0.202 s
11-Jan-2020 05:24:40 testRangeExpression4(org.eclipse.jdt.core.groovy.tests.search.InferencingTests)  Time elapsed: 0.21 s
11-Jan-2020 05:24:40 testRangeExpression5(org.eclipse.jdt.core.groovy.tests.search.InferencingTests)  Time elapsed: 0.198 s
11-Jan-2020 05:24:40 testRangeExpression6(org.eclipse.jdt.core.groovy.tests.search.InferencingTests)  Time elapsed: 0.192 s
11-Jan-2020 05:24:40 testSpread10(org.eclipse.jdt.core.groovy.tests.search.InferencingTests)  Time elapsed: 1.36 s
11-Jan-2020 05:24:40 testSpread11(org.eclipse.jdt.core.groovy.tests.search.InferencingTests)  Time elapsed: 0.245 s
11-Jan-2020 05:24:40 testSpread12(org.eclipse.jdt.core.groovy.tests.search.InferencingTests)  Time elapsed: 0.219 s
11-Jan-2020 05:24:40 testSpread13(org.eclipse.jdt.core.groovy.tests.search.InferencingTests)  Time elapsed: 0.277 s
11-Jan-2020 05:24:40 testSpread14(org.eclipse.jdt.core.groovy.tests.search.InferencingTests)  Time elapsed: 1.173 s
11-Jan-2020 05:24:40 testSpread15(org.eclipse.jdt.core.groovy.tests.search.InferencingTests)  Time elapsed: 0.222 s
11-Jan-2020 05:24:40 testSpread16(org.eclipse.jdt.core.groovy.tests.search.InferencingTests)  Time elapsed: 0.195 s
11-Jan-2020 05:24:40 testSpread17(org.eclipse.jdt.core.groovy.tests.search.InferencingTests)  Time elapsed: 0.219 s
11-Jan-2020 05:24:40 testStaticThisAndSuper1(org.eclipse.jdt.core.groovy.tests.search.InferencingTests)  Time elapsed: 0.261 s
11-Jan-2020 05:24:40 testStaticThisAndSuper2(org.eclipse.jdt.core.groovy.tests.search.InferencingTests)  Time elapsed: 1.274 s
11-Jan-2020 05:24:40 testMethodOverloadsArgumentMatching4a(org.eclipse.jdt.core.groovy.tests.search.InferencingTests)  Time elapsed: 0.199 s
11-Jan-2020 05:24:40 testMethodOverloadsArgumentMatching4b(org.eclipse.jdt.core.groovy.tests.search.InferencingTests)  Time elapsed: 0.21 s
11-Jan-2020 05:24:40 testMethodOverloadsArgumentMatching5a(org.eclipse.jdt.core.groovy.tests.search.InferencingTests)  Time elapsed: 0.193 s
11-Jan-2020 05:24:40 testMethodOverloadsArgumentMatching5b(org.eclipse.jdt.core.groovy.tests.search.InferencingTests)  Time elapsed: 0.216 s
11-Jan-2020 05:24:40 testMethodOverloadsArgumentMatching6a(org.eclipse.jdt.core.groovy.tests.search.InferencingTests)  Time elapsed: 1.186 s
11-Jan-2020 05:24:40 testMethodOverloadsArgumentMatching6b(org.eclipse.jdt.core.groovy.tests.search.InferencingTests)  Time elapsed: 0.215 s
11-Jan-2020 05:24:40 testMethodOverloadsArgumentMatching8a(org.eclipse.jdt.core.groovy.tests.search.InferencingTests)  Time elapsed: 0.217 s
11-Jan-2020 05:24:40 testConstructor1(org.eclipse.jdt.core.groovy.tests.search.InferencingTests)  Time elapsed: 0.35 s
11-Jan-2020 05:24:40 testConstructor2(org.eclipse.jdt.core.groovy.tests.search.InferencingTests)  Time elapsed: 1.271 s
11-Jan-2020 05:24:40 testConstructor3(org.eclipse.jdt.core.groovy.tests.search.InferencingTests)  Time elapsed: 0.258 s
11-Jan-2020 05:24:40 testConstructor4(org.eclipse.jdt.core.groovy.tests.search.InferencingTests)  Time elapsed: 0.372 s
11-Jan-2020 05:24:40 testConstructor5(org.eclipse.jdt.core.groovy.tests.search.InferencingTests)  Time elapsed: 1.261 s
11-Jan-2020 05:24:40 testConstructor6(org.eclipse.jdt.core.groovy.tests.search.InferencingTests)  Time elapsed: 0.345 s
11-Jan-2020 05:24:40 testInterfaceMethodsAsProperty(org.eclipse.jdt.core.groovy.tests.search.InferencingTests)  Time elapsed: 0.255 s
11-Jan-2020 05:24:40 testStaticMethod1(org.eclipse.jdt.core.groovy.tests.search.InferencingTests)  Time elapsed: 1.192 s
11-Jan-2020 05:24:40 testStaticMethod2(org.eclipse.jdt.core.groovy.tests.search.InferencingTests)  Time elapsed: 0.21 s
11-Jan-2020 05:24:40 testStaticMethod3(org.eclipse.jdt.core.groovy.tests.search.InferencingTests)  Time elapsed: 0.127 s
11-Jan-2020 05:24:40 testStaticMethod4(org.eclipse.jdt.core.groovy.tests.search.InferencingTests)  Time elapsed: 0.201 s
11-Jan-2020 05:24:40 testStaticMethod5(org.eclipse.jdt.core.groovy.tests.search.InferencingTests)  Time elapsed: 0.124 s
11-Jan-2020 05:24:40 testStaticMethod6(org.eclipse.jdt.core.groovy.tests.search.InferencingTests)  Time elapsed: 0.136 s
11-Jan-2020 05:24:40 testStaticMethod7(org.eclipse.jdt.core.groovy.tests.search.InferencingTests)  Time elapsed: 1.308 s
11-Jan-2020 05:24:40 testStaticMethod8(org.eclipse.jdt.core.groovy.tests.search.InferencingTests)  Time elapsed: 0.203 s
11-Jan-2020 05:24:40 testStaticMethod9(org.eclipse.jdt.core.groovy.tests.search.InferencingTests)  Time elapsed: 0.214 s
11-Jan-2020 05:24:40 testClassWithInitializer1(org.eclipse.jdt.core.groovy.tests.search.InferencingTests)  Time elapsed: 0.192 s
11-Jan-2020 05:24:40 testClassWithInitializer2(org.eclipse.jdt.core.groovy.tests.search.InferencingTests)  Time elapsed: 0.201 s
11-Jan-2020 05:24:40 testClassWithInitializer3(org.eclipse.jdt.core.groovy.tests.search.InferencingTests)  Time elapsed: 1.177 s
11-Jan-2020 05:24:40 testPostfix(org.eclipse.jdt.core.groovy.tests.search.InferencingTests)  Time elapsed: 0.256 s
11-Jan-2020 05:24:40 testSuperClassMethod4a(org.eclipse.jdt.core.groovy.tests.search.InferencingTests)  Time elapsed: 0.205 s
11-Jan-2020 05:24:40 testSuperClassMethod4b(org.eclipse.jdt.core.groovy.tests.search.InferencingTests)  Time elapsed: 0.203 s
11-Jan-2020 05:24:40 testSuperClassMethod4c(org.eclipse.jdt.core.groovy.tests.search.InferencingTests)  Time elapsed: 1.457 s
11-Jan-2020 05:24:40 testSuperClassMethod5a(org.eclipse.jdt.core.groovy.tests.search.InferencingTests)  Time elapsed: 0.307 s
11-Jan-2020 05:24:40 testSuperClassMethod5b(org.eclipse.jdt.core.groovy.tests.search.InferencingTests)  Time elapsed: 0.351 s
11-Jan-2020 05:24:40 testListSort1(org.eclipse.jdt.core.groovy.tests.search.InferencingTests)  Time elapsed: 0.265 s
11-Jan-2020 05:24:40 testListSort2(org.eclipse.jdt.core.groovy.tests.search.InferencingTests)  Time elapsed: 1.12 s
11-Jan-2020 05:24:40 testListSort3(org.eclipse.jdt.core.groovy.tests.search.InferencingTests)  Time elapsed: 0.262 s
11-Jan-2020 05:24:40 testLocalVar1(org.eclipse.jdt.core.groovy.tests.search.InferencingTests)  Time elapsed: 0.202 s
11-Jan-2020 05:24:40 testLocalVar2(org.eclipse.jdt.core.groovy.tests.search.InferencingTests)  Time elapsed: 0.208 s
11-Jan-2020 05:24:40 testLocalVar3(org.eclipse.jdt.core.groovy.tests.search.InferencingTests)  Time elapsed: 1.186 s
11-Jan-2020 05:24:40 testLocalVar4(org.eclipse.jdt.core.groovy.tests.search.InferencingTests)  Time elapsed: 0.211 s
11-Jan-2020 05:24:40 testLocalVar5(org.eclipse.jdt.core.groovy.tests.search.InferencingTests)  Time elapsed: 0.201 s
11-Jan-2020 05:24:40 testLocalVar6(org.eclipse.jdt.core.groovy.tests.search.InferencingTests)  Time elapsed: 0.202 s
11-Jan-2020 05:24:40 testLocalVar7(org.eclipse.jdt.core.groovy.tests.search.InferencingTests)  Time elapsed: 0.22 s
11-Jan-2020 05:24:40 testLocalVar8(org.eclipse.jdt.core.groovy.tests.search.InferencingTests)  Time elapsed: 1.162 s
11-Jan-2020 05:24:40 testLocalVar9(org.eclipse.jdt.core.groovy.tests.search.InferencingTests)  Time elapsed: 0.193 s
11-Jan-2020 05:24:40 testIndirectInterfaceMethod(org.eclipse.jdt.core.groovy.tests.search.InferencingTests)  Time elapsed: 0.266 s
11-Jan-2020 05:24:40 testMapLiteral(org.eclipse.jdt.core.groovy.tests.search.InferencingTests)  Time elapsed: 0.202 s
11-Jan-2020 05:24:40 testListRemove(org.eclipse.jdt.core.groovy.tests.search.InferencingTests)  Time elapsed: 1.167 s
11-Jan-2020 05:24:40 testCategoryMethodAsProperty(org.eclipse.jdt.core.groovy.tests.search.InferencingTests)  Time elapsed: 0.317 s
11-Jan-2020 05:24:40 testNothingIsUnknownWithCategories(org.eclipse.jdt.core.groovy.tests.search.InferencingTests)  Time elapsed: 0.21 s
11-Jan-2020 05:24:40 testImplicitVar1(org.eclipse.jdt.core.groovy.tests.search.InferencingTests)  Time elapsed: 0.199 s
11-Jan-2020 05:24:40 testImplicitVar2(org.eclipse.jdt.core.groovy.tests.search.InferencingTests)  Time elapsed: 0.225 s
11-Jan-2020 05:24:40 testImplicitVar3(org.eclipse.jdt.core.groovy.tests.search.InferencingTests)  Time elapsed: 1.144 s
11-Jan-2020 05:24:40 testImplicitVar4(org.eclipse.jdt.core.groovy.tests.search.InferencingTests)  Time elapsed: 0.224 s
11-Jan-2020 05:24:40 testImplicitVar5(org.eclipse.jdt.core.groovy.tests.search.InferencingTests)  Time elapsed: 0.219 s
11-Jan-2020 05:24:40 testImplicitVar6(org.eclipse.jdt.core.groovy.tests.search.InferencingTests)  Time elapsed: 0.19 s
11-Jan-2020 05:24:40 testImplicitVar7(org.eclipse.jdt.core.groovy.tests.search.InferencingTests)  Time elapsed: 1.293 s
11-Jan-2020 05:24:40 testClassLiteral1(org.eclipse.jdt.core.groovy.tests.search.InferencingTests)  Time elapsed: 0.318 s
11-Jan-2020 05:24:40 testClassLiteral2(org.eclipse.jdt.core.groovy.tests.search.InferencingTests)  Time elapsed: 0.215 s
11-Jan-2020 05:24:40 testClassLiteral3(org.eclipse.jdt.core.groovy.tests.search.InferencingTests)  Time elapsed: 0.2 s
11-Jan-2020 05:24:40 testClassLiteral4(org.eclipse.jdt.core.groovy.tests.search.InferencingTests)  Time elapsed: 0.208 s
11-Jan-2020 05:24:40 testClassLiteral5(org.eclipse.jdt.core.groovy.tests.search.InferencingTests)  Time elapsed: 1.778 s
11-Jan-2020 05:24:40 testInstanceOf10(org.eclipse.jdt.core.groovy.tests.search.InferencingTests)  Time elapsed: 0.369 s
11-Jan-2020 05:24:40 testInstanceOf11(org.eclipse.jdt.core.groovy.tests.search.InferencingTests)  Time elapsed: 1.697 s
11-Jan-2020 05:24:40 testInstanceOf12(org.eclipse.jdt.core.groovy.tests.search.InferencingTests)  Time elapsed: 0.35 s
11-Jan-2020 05:24:40 testInstanceOf1a(org.eclipse.jdt.core.groovy.tests.search.InferencingTests)  Time elapsed: 1.276 s
11-Jan-2020 05:24:40 testInstanceOf1b(org.eclipse.jdt.core.groovy.tests.search.InferencingTests)  Time elapsed: 0.387 s
11-Jan-2020 05:24:40 testInstanceOf2a(org.eclipse.jdt.core.groovy.tests.search.InferencingTests) skipped
11-Jan-2020 05:24:40 testInstanceOf3a(org.eclipse.jdt.core.groovy.tests.search.InferencingTests) skipped
11-Jan-2020 05:24:40 testStaticMethod10(org.eclipse.jdt.core.groovy.tests.search.InferencingTests)  Time elapsed: 0.86 s
11-Jan-2020 05:24:40 testStaticMethod11(org.eclipse.jdt.core.groovy.tests.search.InferencingTests)  Time elapsed: 0.241 s
11-Jan-2020 05:24:40 testStaticMethod12(org.eclipse.jdt.core.groovy.tests.search.InferencingTests)  Time elapsed: 0.22 s
11-Jan-2020 05:24:40 testThisInInnerClass(org.eclipse.jdt.core.groovy.tests.search.InferencingTests)  Time elapsed: 0.266 s
11-Jan-2020 05:24:40 testStaticImports1(org.eclipse.jdt.core.groovy.tests.search.InferencingTests)  Time elapsed: 1.944 s
11-Jan-2020 05:24:40 testStaticImports2(org.eclipse.jdt.core.groovy.tests.search.InferencingTests)  Time elapsed: 0.214 s
11-Jan-2020 05:24:40 testStaticImports3(org.eclipse.jdt.core.groovy.tests.search.InferencingTests)  Time elapsed: 0.214 s
11-Jan-2020 05:24:40 testStaticImports4(org.eclipse.jdt.core.groovy.tests.search.InferencingTests)  Time elapsed: 0.205 s
11-Jan-2020 05:24:40 testInstanceOf10a(org.eclipse.jdt.core.groovy.tests.search.InferencingTests) skipped
11-Jan-2020 05:24:40 testMultiDecl1(org.eclipse.jdt.core.groovy.tests.search.InferencingTests)  Time elapsed: 0.254 s
11-Jan-2020 05:24:40 testMultiDecl2(org.eclipse.jdt.core.groovy.tests.search.InferencingTests)  Time elapsed: 0.316 s
11-Jan-2020 05:24:40 testMultiDecl3(org.eclipse.jdt.core.groovy.tests.search.InferencingTests)  Time elapsed: 0.268 s
11-Jan-2020 05:24:40 testMultiDecl4(org.eclipse.jdt.core.groovy.tests.search.InferencingTests)  Time elapsed: 1.857 s
11-Jan-2020 05:24:40 testMultiDecl6(org.eclipse.jdt.core.groovy.tests.search.InferencingTests)  Time elapsed: 0.259 s
11-Jan-2020 05:24:40 testMultiDecl7(org.eclipse.jdt.core.groovy.tests.search.InferencingTests)  Time elapsed: 0.245 s
11-Jan-2020 05:24:40 testMultiDecl8(org.eclipse.jdt.core.groovy.tests.search.InferencingTests)  Time elapsed: 1.611 s
11-Jan-2020 05:24:40 testMultiDecl9(org.eclipse.jdt.core.groovy.tests.search.InferencingTests)  Time elapsed: 0.263 s
11-Jan-2020 05:24:40 testLocalMethod1(org.eclipse.jdt.core.groovy.tests.search.InferencingTests)  Time elapsed: 0.206 s
11-Jan-2020 05:24:40 testLocalMethod2(org.eclipse.jdt.core.groovy.tests.search.InferencingTests)  Time elapsed: 0.215 s
11-Jan-2020 05:24:40 testLocalMethod3(org.eclipse.jdt.core.groovy.tests.search.InferencingTests)  Time elapsed: 1.667 s
11-Jan-2020 05:24:40 testLocalMethod4(org.eclipse.jdt.core.groovy.tests.search.InferencingTests)  Time elapsed: 0.213 s
11-Jan-2020 05:24:40 testLocalMethod5(org.eclipse.jdt.core.groovy.tests.search.InferencingTests)  Time elapsed: 0.215 s
11-Jan-2020 05:24:40 testLocalVar10(org.eclipse.jdt.core.groovy.tests.search.InferencingTests)  Time elapsed: 0.218 s
11-Jan-2020 05:24:40 testLocalVar11(org.eclipse.jdt.core.groovy.tests.search.InferencingTests)  Time elapsed: 1.525 s
11-Jan-2020 05:24:40 testLocalVar12(org.eclipse.jdt.core.groovy.tests.search.InferencingTests)  Time elapsed: 0.224 s
11-Jan-2020 05:24:40 testLocalVar13(org.eclipse.jdt.core.groovy.tests.search.InferencingTests)  Time elapsed: 0.206 s
11-Jan-2020 05:24:40 testLocalVar14(org.eclipse.jdt.core.groovy.tests.search.InferencingTests)  Time elapsed: 1.695 s
11-Jan-2020 05:24:40 testLocalVar15(org.eclipse.jdt.core.groovy.tests.search.InferencingTests)  Time elapsed: 0.384 s
11-Jan-2020 05:24:40 testLocalVar16(org.eclipse.jdt.core.groovy.tests.search.InferencingTests)  Time elapsed: 0.363 s
11-Jan-2020 05:24:40 testLocalVar17(org.eclipse.jdt.core.groovy.tests.search.InferencingTests)  Time elapsed: 1.59 s
11-Jan-2020 05:24:40 testLocalVar18(org.eclipse.jdt.core.groovy.tests.search.InferencingTests)  Time elapsed: 0.349 s
11-Jan-2020 05:24:40 testLocalVar19(org.eclipse.jdt.core.groovy.tests.search.InferencingTests)  Time elapsed: 1.335 s
11-Jan-2020 05:24:40 testLocalVar20(org.eclipse.jdt.core.groovy.tests.search.InferencingTests)  Time elapsed: 0.342 s
11-Jan-2020 05:24:40 testLocalVar21(org.eclipse.jdt.core.groovy.tests.search.InferencingTests)  Time elapsed: 1.832 s
11-Jan-2020 05:24:40 testLocalVar22(org.eclipse.jdt.core.groovy.tests.search.InferencingTests)  Time elapsed: 0.42 s
11-Jan-2020 05:24:40 testLocalVar23(org.eclipse.jdt.core.groovy.tests.search.InferencingTests)  Time elapsed: 1.469 s
11-Jan-2020 05:24:40 testLocalVar24(org.eclipse.jdt.core.groovy.tests.search.InferencingTests)  Time elapsed: 1.381 s
11-Jan-2020 05:24:40 testLocalVar25(org.eclipse.jdt.core.groovy.tests.search.InferencingTests)  Time elapsed: 0.442 s
11-Jan-2020 05:24:40 testLocalVar26(org.eclipse.jdt.core.groovy.tests.search.InferencingTests)  Time elapsed: 0.214 s
11-Jan-2020 05:24:40 testLocalVar27(org.eclipse.jdt.core.groovy.tests.search.InferencingTests)  Time elapsed: 1.615 s
11-Jan-2020 05:24:40 testLocalVar28(org.eclipse.jdt.core.groovy.tests.search.InferencingTests)  Time elapsed: 0.232 s
11-Jan-2020 05:24:40 testNoGString(org.eclipse.jdt.core.groovy.tests.search.InferencingTests)  Time elapsed: 0.221 s
11-Jan-2020 05:24:40 testObjectMethodOnInterfaceAsProperty(org.eclipse.jdt.core.groovy.tests.search.InferencingTests)  Time elapsed: 1.179 s
11-Jan-2020 05:24:40 testMatcher1(org.eclipse.jdt.core.groovy.tests.search.InferencingTests)  Time elapsed: 0.202 s
11-Jan-2020 05:24:40 testMatcher2(org.eclipse.jdt.core.groovy.tests.search.InferencingTests)  Time elapsed: 0.233 s
11-Jan-2020 05:24:40 testCatchBlock1(org.eclipse.jdt.core.groovy.tests.search.InferencingTests)  Time elapsed: 0.219 s
11-Jan-2020 05:24:40 testCatchBlock2(org.eclipse.jdt.core.groovy.tests.search.InferencingTests)  Time elapsed: 1.638 s
11-Jan-2020 05:24:40 testCatchBlock3(org.eclipse.jdt.core.groovy.tests.search.InferencingTests)  Time elapsed: 0.34 s
11-Jan-2020 05:24:40 testCatchBlock4(org.eclipse.jdt.core.groovy.tests.search.InferencingTests)  Time elapsed: 0.218 s
11-Jan-2020 05:24:40 testCatchBlock5(org.eclipse.jdt.core.groovy.tests.search.InferencingTests)  Time elapsed: 0.234 s
11-Jan-2020 05:24:40 testInterfaceMethodAsProperty2(org.eclipse.jdt.core.groovy.tests.search.InferencingTests)  Time elapsed: 1.506 s
11-Jan-2020 05:24:40 testInterfaceMethodAsProperty3(org.eclipse.jdt.core.groovy.tests.search.InferencingTests)  Time elapsed: 0.392 s
11-Jan-2020 05:24:40 testGetAt1(org.eclipse.jdt.core.groovy.tests.search.InferencingTests)  Time elapsed: 0.237 s
11-Jan-2020 05:24:40 testGetAt2(org.eclipse.jdt.core.groovy.tests.search.InferencingTests)  Time elapsed: 1.352 s
11-Jan-2020 05:24:40 testGetAt3(org.eclipse.jdt.core.groovy.tests.search.InferencingTests)  Time elapsed: 0.224 s
11-Jan-2020 05:24:40 testGetAt4(org.eclipse.jdt.core.groovy.tests.search.InferencingTests)  Time elapsed: 0.219 s
11-Jan-2020 05:24:40 testGetAt5(org.eclipse.jdt.core.groovy.tests.search.InferencingTests)  Time elapsed: 1.707 s
11-Jan-2020 05:24:40 testGetAt6(org.eclipse.jdt.core.groovy.tests.search.InferencingTests)  Time elapsed: 0.276 s
11-Jan-2020 05:24:40 testGetAt7(org.eclipse.jdt.core.groovy.tests.search.InferencingTests)  Time elapsed: 0.305 s
11-Jan-2020 05:24:40 testGetAt8(org.eclipse.jdt.core.groovy.tests.search.InferencingTests) skipped
11-Jan-2020 05:24:40 testGetAt9(org.eclipse.jdt.core.groovy.tests.search.InferencingTests) skipped
11-Jan-2020 05:24:40 testFieldWithInitializer1(org.eclipse.jdt.core.groovy.tests.search.InferencingTests)  Time elapsed: 0.204 s
11-Jan-2020 05:24:40 testFieldWithInitializer2(org.eclipse.jdt.core.groovy.tests.search.InferencingTests)  Time elapsed: 0.238 s
11-Jan-2020 05:24:40 testNested1(org.eclipse.jdt.core.groovy.tests.search.InferencingTests)  Time elapsed: 1.164 s
11-Jan-2020 05:24:40 testNested2(org.eclipse.jdt.core.groovy.tests.search.InferencingTests)  Time elapsed: 0.207 s
11-Jan-2020 05:24:40 testNested3(org.eclipse.jdt.core.groovy.tests.search.InferencingTests)  Time elapsed: 0.219 s
11-Jan-2020 05:24:40 testNested4(org.eclipse.jdt.core.groovy.tests.search.InferencingTests)  Time elapsed: 0.237 s
11-Jan-2020 05:24:40 testIndirectInterfaceConstant(org.eclipse.jdt.core.groovy.tests.search.InferencingTests)  Time elapsed: 1.077 s
11-Jan-2020 05:24:40 testInstanceOf1(org.eclipse.jdt.core.groovy.tests.search.InferencingTests)  Time elapsed: 0.374 s
11-Jan-2020 05:24:40 testInstanceOf2(org.eclipse.jdt.core.groovy.tests.search.InferencingTests)  Time elapsed: 1.433 s
11-Jan-2020 05:24:40 testInstanceOf3(org.eclipse.jdt.core.groovy.tests.search.InferencingTests)  Time elapsed: 1.467 s
11-Jan-2020 05:24:40 testInstanceOf4(org.eclipse.jdt.core.groovy.tests.search.InferencingTests)  Time elapsed: 0.56 s
11-Jan-2020 05:24:40 testInstanceOf5(org.eclipse.jdt.core.groovy.tests.search.InferencingTests)  Time elapsed: 1.388 s
11-Jan-2020 05:24:40 testInstanceOf6(org.eclipse.jdt.core.groovy.tests.search.InferencingTests)  Time elapsed: 1.8 s
11-Jan-2020 05:24:40 testInstanceOf7(org.eclipse.jdt.core.groovy.tests.search.InferencingTests)  Time elapsed: 0.446 s
11-Jan-2020 05:24:40 testInstanceOf8(org.eclipse.jdt.core.groovy.tests.search.InferencingTests)  Time elapsed: 1.317 s
11-Jan-2020 05:24:40 testInstanceOf9(org.eclipse.jdt.core.groovy.tests.search.InferencingTests)  Time elapsed: 1.542 s
11-Jan-2020 05:24:40 testAnonInner1(org.eclipse.jdt.core.groovy.tests.search.InferencingTests)  Time elapsed: 0.211 s
11-Jan-2020 05:24:40 testAnonInner2(org.eclipse.jdt.core.groovy.tests.search.InferencingTests)  Time elapsed: 0.24 s
11-Jan-2020 05:24:40 testAnonInner3(org.eclipse.jdt.core.groovy.tests.search.InferencingTests)  Time elapsed: 0.247 s
11-Jan-2020 05:24:40 testAnonInner4(org.eclipse.jdt.core.groovy.tests.search.InferencingTests)  Time elapsed: 1.009 s
11-Jan-2020 05:24:40 testAnonInner5(org.eclipse.jdt.core.groovy.tests.search.InferencingTests)  Time elapsed: 0.207 s
11-Jan-2020 05:24:40 testAnonInner6(org.eclipse.jdt.core.groovy.tests.search.InferencingTests)  Time elapsed: 0.221 s
11-Jan-2020 05:24:40 testAnonInner7(org.eclipse.jdt.core.groovy.tests.search.InferencingTests)  Time elapsed: 1.165 s
11-Jan-2020 05:24:40 testAnonInner8(org.eclipse.jdt.core.groovy.tests.search.InferencingTests)  Time elapsed: 0.388 s
11-Jan-2020 05:24:40 testNumber1(org.eclipse.jdt.core.groovy.tests.search.InferencingTests)  Time elapsed: 1.2 s
11-Jan-2020 05:24:40 testNumber2(org.eclipse.jdt.core.groovy.tests.search.InferencingTests)  Time elapsed: 0.237 s
11-Jan-2020 05:24:40 testNumber3(org.eclipse.jdt.core.groovy.tests.search.InferencingTests)  Time elapsed: 0.301 s
11-Jan-2020 05:24:40 testNumber4(org.eclipse.jdt.core.groovy.tests.search.InferencingTests)  Time elapsed: 1.592 s
11-Jan-2020 05:24:40 testNumber5(org.eclipse.jdt.core.groovy.tests.search.InferencingTests)  Time elapsed: 0.293 s
11-Jan-2020 05:24:40 testNumber6(org.eclipse.jdt.core.groovy.tests.search.InferencingTests)  Time elapsed: 0.248 s
11-Jan-2020 05:24:40 testSpread1(org.eclipse.jdt.core.groovy.tests.search.InferencingTests)  Time elapsed: 0.219 s
11-Jan-2020 05:24:40 testSpread2(org.eclipse.jdt.core.groovy.tests.search.InferencingTests)  Time elapsed: 1.181 s
11-Jan-2020 05:24:40 testSpread3(org.eclipse.jdt.core.groovy.tests.search.InferencingTests)  Time elapsed: 0.217 s
11-Jan-2020 05:24:40 testSpread4(org.eclipse.jdt.core.groovy.tests.search.InferencingTests)  Time elapsed: 0.203 s
11-Jan-2020 05:24:40 testSpread5(org.eclipse.jdt.core.groovy.tests.search.InferencingTests)  Time elapsed: 1.317 s
11-Jan-2020 05:24:40 testSpread6(org.eclipse.jdt.core.groovy.tests.search.InferencingTests)  Time elapsed: 0.234 s
11-Jan-2020 05:24:40 testSpread7(org.eclipse.jdt.core.groovy.tests.search.InferencingTests)  Time elapsed: 0.263 s
11-Jan-2020 05:24:40 testSpread8(org.eclipse.jdt.core.groovy.tests.search.InferencingTests)  Time elapsed: 0.234 s
11-Jan-2020 05:24:40 testSpread9(org.eclipse.jdt.core.groovy.tests.search.InferencingTests)  Time elapsed: 1.1 s
11-Jan-2020 05:24:40 testPattern1(org.eclipse.jdt.core.groovy.tests.search.InferencingTests)  Time elapsed: 0.262 s
11-Jan-2020 05:24:40 testPattern2(org.eclipse.jdt.core.groovy.tests.search.InferencingTests)  Time elapsed: 0.278 s
11-Jan-2020 05:24:40 testClassReference2a(org.eclipse.jdt.core.groovy.tests.search.InferencingTests)  Time elapsed: 1.083 s
11-Jan-2020 05:24:40 testClassReference3a(org.eclipse.jdt.core.groovy.tests.search.InferencingTests)  Time elapsed: 0.271 s
11-Jan-2020 05:24:40 testClassReference4a(org.eclipse.jdt.core.groovy.tests.search.InferencingTests)  Time elapsed: 0.288 s
11-Jan-2020 05:24:40 testClassReference4b(org.eclipse.jdt.core.groovy.tests.search.InferencingTests)  Time elapsed: 1.254 s
11-Jan-2020 05:24:40 testString1(org.eclipse.jdt.core.groovy.tests.search.InferencingTests)  Time elapsed: 0.243 s
11-Jan-2020 05:24:40 testString2(org.eclipse.jdt.core.groovy.tests.search.InferencingTests)  Time elapsed: 0.234 s
11-Jan-2020 05:24:40 testString3(org.eclipse.jdt.core.groovy.tests.search.InferencingTests)  Time elapsed: 1.455 s
11-Jan-2020 05:24:40 testSuperFieldReference1(org.eclipse.jdt.core.groovy.tests.search.InferencingTests)  Time elapsed: 0.324 s
11-Jan-2020 05:24:40 testSuperFieldReference2(org.eclipse.jdt.core.groovy.tests.search.InferencingTests)  Time elapsed: 0.218 s
11-Jan-2020 05:24:40 testSuperFieldReference3(org.eclipse.jdt.core.groovy.tests.search.InferencingTests)  Time elapsed: 1.108 s
11-Jan-2020 05:24:40 testSuperFieldReference4(org.eclipse.jdt.core.groovy.tests.search.InferencingTests)  Time elapsed: 0.242 s
11-Jan-2020 05:24:40 testSuperFieldReference5(org.eclipse.jdt.core.groovy.tests.search.InferencingTests)  Time elapsed: 0.324 s
11-Jan-2020 05:24:40 testClassReference1(org.eclipse.jdt.core.groovy.tests.search.InferencingTests)  Time elapsed: 1.372 s
11-Jan-2020 05:24:40 testClassReference2(org.eclipse.jdt.core.groovy.tests.search.InferencingTests)  Time elapsed: 0.301 s
11-Jan-2020 05:24:40 testClassReference3(org.eclipse.jdt.core.groovy.tests.search.InferencingTests)  Time elapsed: 0.242 s
11-Jan-2020 05:24:40 testClassReference4(org.eclipse.jdt.core.groovy.tests.search.InferencingTests)  Time elapsed: 1.342 s
11-Jan-2020 05:24:40 testPropertyNodeFromJava1(org.eclipse.jdt.core.groovy.tests.search.JDTPropertyNodeInferencingTests)  Time elapsed: 0.24 s
11-Jan-2020 05:24:40 testPropertyNodeFromJava2(org.eclipse.jdt.core.groovy.tests.search.JDTPropertyNodeInferencingTests)  Time elapsed: 0.229 s
11-Jan-2020 05:24:40 testPropertyNodeFromJava3(org.eclipse.jdt.core.groovy.tests.search.JDTPropertyNodeInferencingTests)  Time elapsed: 1.513 s
11-Jan-2020 05:24:40 testPropertyNodeFromJava4(org.eclipse.jdt.core.groovy.tests.search.JDTPropertyNodeInferencingTests)  Time elapsed: 0.216 s
11-Jan-2020 05:24:40 testNodeFromJava1(org.eclipse.jdt.core.groovy.tests.search.JDTPropertyNodeInferencingTests)  Time elapsed: 0.262 s
11-Jan-2020 05:24:40 testPropertyNodeReferenceInBinary1(org.eclipse.jdt.core.groovy.tests.search.JDTPropertyNodeInferencingTests)  Time elapsed: 0.254 s
11-Jan-2020 05:24:40 testVarReferenceInGString1(org.eclipse.jdt.core.groovy.tests.search.LocalVariableReferenceSearchTests)  Time elapsed: 1.444 s
11-Jan-2020 05:24:40 testVarReferenceInGString2(org.eclipse.jdt.core.groovy.tests.search.LocalVariableReferenceSearchTests)  Time elapsed: 0.247 s
11-Jan-2020 05:24:40 testVarReferenceInGString3(org.eclipse.jdt.core.groovy.tests.search.LocalVariableReferenceSearchTests)  Time elapsed: 0.262 s
11-Jan-2020 05:24:40 testVarReferenceInGString4(org.eclipse.jdt.core.groovy.tests.search.LocalVariableReferenceSearchTests)  Time elapsed: 1.635 s
11-Jan-2020 05:24:40 testVarReferenceInGString5(org.eclipse.jdt.core.groovy.tests.search.LocalVariableReferenceSearchTests)  Time elapsed: 0.287 s
11-Jan-2020 05:24:40 testVarReference10(org.eclipse.jdt.core.groovy.tests.search.LocalVariableReferenceSearchTests)  Time elapsed: 0.279 s
11-Jan-2020 05:24:40 testVarReference1(org.eclipse.jdt.core.groovy.tests.search.LocalVariableReferenceSearchTests)  Time elapsed: 0.244 s
11-Jan-2020 05:24:40 testVarReference2(org.eclipse.jdt.core.groovy.tests.search.LocalVariableReferenceSearchTests)  Time elapsed: 1.155 s
11-Jan-2020 05:24:40 testVarReference3(org.eclipse.jdt.core.groovy.tests.search.LocalVariableReferenceSearchTests)  Time elapsed: 0.302 s
11-Jan-2020 05:24:40 testVarReference4(org.eclipse.jdt.core.groovy.tests.search.LocalVariableReferenceSearchTests)  Time elapsed: 0.281 s
11-Jan-2020 05:24:40 testVarReference5(org.eclipse.jdt.core.groovy.tests.search.LocalVariableReferenceSearchTests)  Time elapsed: 1.301 s
11-Jan-2020 05:24:40 testVarReference6(org.eclipse.jdt.core.groovy.tests.search.LocalVariableReferenceSearchTests)  Time elapsed: 0.268 s
11-Jan-2020 05:24:40 testVarReference7(org.eclipse.jdt.core.groovy.tests.search.LocalVariableReferenceSearchTests)  Time elapsed: 0.21 s
11-Jan-2020 05:24:40 testVarReference8(org.eclipse.jdt.core.groovy.tests.search.LocalVariableReferenceSearchTests)  Time elapsed: 0.254 s
11-Jan-2020 05:24:40 testVarReference9(org.eclipse.jdt.core.groovy.tests.search.LocalVariableReferenceSearchTests)  Time elapsed: 1.716 s
11-Jan-2020 05:24:40 testExplicitPropertySetterSearch1(org.eclipse.jdt.core.groovy.tests.search.MethodReferenceSearchTests)  Time elapsed: 0.737 s
11-Jan-2020 05:24:40 testExplicitPropertySetterSearch2(org.eclipse.jdt.core.groovy.tests.search.MethodReferenceSearchTests)  Time elapsed: 2.439 s
11-Jan-2020 05:24:40 testOverloadedMethodReferences1(org.eclipse.jdt.core.groovy.tests.search.MethodReferenceSearchTests)  Time elapsed: 0.367 s
11-Jan-2020 05:24:40 testOverloadedMethodReferences2(org.eclipse.jdt.core.groovy.tests.search.MethodReferenceSearchTests)  Time elapsed: 0.357 s
11-Jan-2020 05:24:40 testOverloadedMethodReferences3(org.eclipse.jdt.core.groovy.tests.search.MethodReferenceSearchTests)  Time elapsed: 1.592 s
11-Jan-2020 05:24:40 testOverloadedMethodReferences4(org.eclipse.jdt.core.groovy.tests.search.MethodReferenceSearchTests)  Time elapsed: 0.327 s
11-Jan-2020 05:24:40 testOverloadedMethodReferences5(org.eclipse.jdt.core.groovy.tests.search.MethodReferenceSearchTests)  Time elapsed: 0.315 s
11-Jan-2020 05:24:40 testStaticMethodReferenceSearch(org.eclipse.jdt.core.groovy.tests.search.MethodReferenceSearchTests)  Time elapsed: 1.101 s
11-Jan-2020 05:24:40 testMethodReferencesInClass1(org.eclipse.jdt.core.groovy.tests.search.MethodReferenceSearchTests)  Time elapsed: 0.374 s
11-Jan-2020 05:24:40 testMethodReferencesInClass2(org.eclipse.jdt.core.groovy.tests.search.MethodReferenceSearchTests)  Time elapsed: 0.278 s
11-Jan-2020 05:24:40 testMethodReferencesInClass3(org.eclipse.jdt.core.groovy.tests.search.MethodReferenceSearchTests)  Time elapsed: 1.273 s
11-Jan-2020 05:24:40 testGenericsMethodReferenceSearch(org.eclipse.jdt.core.groovy.tests.search.MethodReferenceSearchTests)  Time elapsed: 0.56 s
11-Jan-2020 05:24:40 testMethodReferencesInScript1(org.eclipse.jdt.core.groovy.tests.search.MethodReferenceSearchTests)  Time elapsed: 0.346 s
11-Jan-2020 05:24:40 testMethodReferencesInScript2(org.eclipse.jdt.core.groovy.tests.search.MethodReferenceSearchTests)  Time elapsed: 0.33 s
11-Jan-2020 05:24:40 testMethodReferencesInScript3(org.eclipse.jdt.core.groovy.tests.search.MethodReferenceSearchTests)  Time elapsed: 1.486 s
11-Jan-2020 05:24:40 testMethodReferencesInScript4(org.eclipse.jdt.core.groovy.tests.search.MethodReferenceSearchTests)  Time elapsed: 0.298 s
11-Jan-2020 05:24:40 testMethodReferencesInScript5(org.eclipse.jdt.core.groovy.tests.search.MethodReferenceSearchTests)  Time elapsed: 1.578 s
11-Jan-2020 05:24:40 testMethodReferencesInScript6(org.eclipse.jdt.core.groovy.tests.search.MethodReferenceSearchTests)  Time elapsed: 0.266 s
11-Jan-2020 05:24:40 testMethodReferencesInScript7(org.eclipse.jdt.core.groovy.tests.search.MethodReferenceSearchTests)  Time elapsed: 0.305 s
11-Jan-2020 05:24:40 testMethodReferencesInScript8(org.eclipse.jdt.core.groovy.tests.search.MethodReferenceSearchTests)  Time elapsed: 1.344 s
11-Jan-2020 05:24:40 testMethodReferencesInScript9(org.eclipse.jdt.core.groovy.tests.search.MethodReferenceSearchTests)  Time elapsed: 0.32 s
11-Jan-2020 05:24:40 testOverloadedMethodReferences5a(org.eclipse.jdt.core.groovy.tests.search.MethodReferenceSearchTests) skipped
11-Jan-2020 05:24:40 testOverloadedMethodReferences5b(org.eclipse.jdt.core.groovy.tests.search.MethodReferenceSearchTests)  Time elapsed: 0.313 s
11-Jan-2020 05:24:40 testMethodWithDefaultParameters1(org.eclipse.jdt.core.groovy.tests.search.MethodReferenceSearchTests)  Time elapsed: 1.704 s
11-Jan-2020 05:24:40 testMethodWithDefaultParameters2(org.eclipse.jdt.core.groovy.tests.search.MethodReferenceSearchTests)  Time elapsed: 0.336 s
11-Jan-2020 05:24:40 testMethodWithDefaultParameters3(org.eclipse.jdt.core.groovy.tests.search.MethodReferenceSearchTests)  Time elapsed: 0.428 s
11-Jan-2020 05:24:40 testMethodWithDefaultParameters4(org.eclipse.jdt.core.groovy.tests.search.MethodReferenceSearchTests) skipped
11-Jan-2020 05:24:40 testExplicitPropertyGetterSearch1(org.eclipse.jdt.core.groovy.tests.search.MethodReferenceSearchTests)  Time elapsed: 1.45 s
11-Jan-2020 05:24:40 testExplicitPropertyGetterSearch2(org.eclipse.jdt.core.groovy.tests.search.MethodReferenceSearchTests)  Time elapsed: 0.686 s
11-Jan-2020 05:24:40 testExplicitPropertyGetterSearch3(org.eclipse.jdt.core.groovy.tests.search.MethodReferenceSearchTests)  Time elapsed: 0.71 s
11-Jan-2020 05:24:40 testRightShift(org.eclipse.jdt.core.groovy.tests.search.OperatorOverloadingInferencingTests)  Time elapsed: 1.505 s
11-Jan-2020 05:24:40 testLeftShift(org.eclipse.jdt.core.groovy.tests.search.OperatorOverloadingInferencingTests)  Time elapsed: 0.285 s
11-Jan-2020 05:24:40 testAnd(org.eclipse.jdt.core.groovy.tests.search.OperatorOverloadingInferencingTests)  Time elapsed: 0.221 s
11-Jan-2020 05:24:40 testMod(org.eclipse.jdt.core.groovy.tests.search.OperatorOverloadingInferencingTests)  Time elapsed: 0.285 s
11-Jan-2020 05:24:40 testXor(org.eclipse.jdt.core.groovy.tests.search.OperatorOverloadingInferencingTests)  Time elapsed: 1.671 s
11-Jan-2020 05:24:40 testPlus1(org.eclipse.jdt.core.groovy.tests.search.OperatorOverloadingInferencingTests)  Time elapsed: 0.263 s
11-Jan-2020 05:24:40 testPlus2(org.eclipse.jdt.core.groovy.tests.search.OperatorOverloadingInferencingTests)  Time elapsed: 0.284 s
11-Jan-2020 05:24:40 testPlus3(org.eclipse.jdt.core.groovy.tests.search.OperatorOverloadingInferencingTests)  Time elapsed: 1.479 s
11-Jan-2020 05:24:40 testNumberPlusGString(org.eclipse.jdt.core.groovy.tests.search.OperatorOverloadingInferencingTests)  Time elapsed: 0.248 s
11-Jan-2020 05:24:40 testOr(org.eclipse.jdt.core.groovy.tests.search.OperatorOverloadingInferencingTests)  Time elapsed: 0.288 s
11-Jan-2020 05:24:40 testPrefix1(org.eclipse.jdt.core.groovy.tests.search.OperatorOverloadingInferencingTests)  Time elapsed: 0.222 s
11-Jan-2020 05:24:40 testPrefix2(org.eclipse.jdt.core.groovy.tests.search.OperatorOverloadingInferencingTests)  Time elapsed: 1.478 s
11-Jan-2020 05:24:40 testPrefix3(org.eclipse.jdt.core.groovy.tests.search.OperatorOverloadingInferencingTests)  Time elapsed: 0.235 s
11-Jan-2020 05:24:40 testPrefix4(org.eclipse.jdt.core.groovy.tests.search.OperatorOverloadingInferencingTests)  Time elapsed: 0.232 s
11-Jan-2020 05:24:40 testPrefix5(org.eclipse.jdt.core.groovy.tests.search.OperatorOverloadingInferencingTests)  Time elapsed: 0.237 s
11-Jan-2020 05:24:40 testPrefix6(org.eclipse.jdt.core.groovy.tests.search.OperatorOverloadingInferencingTests)  Time elapsed: 1.083 s
11-Jan-2020 05:24:40 testLongExpr1(org.eclipse.jdt.core.groovy.tests.search.OperatorOverloadingInferencingTests)  Time elapsed: 0.244 s
11-Jan-2020 05:24:40 testLongExpr2(org.eclipse.jdt.core.groovy.tests.search.OperatorOverloadingInferencingTests)  Time elapsed: 0.256 s
11-Jan-2020 05:24:40 testLongExpr3(org.eclipse.jdt.core.groovy.tests.search.OperatorOverloadingInferencingTests)  Time elapsed: 0.288 s
11-Jan-2020 05:24:40 testAttributeExpr1(org.eclipse.jdt.core.groovy.tests.search.OperatorOverloadingInferencingTests)  Time elapsed: 1.102 s
11-Jan-2020 05:24:40 testAttributeExpr2(org.eclipse.jdt.core.groovy.tests.search.OperatorOverloadingInferencingTests)  Time elapsed: 0.223 s
11-Jan-2020 05:24:40 testNumberPlusString(org.eclipse.jdt.core.groovy.tests.search.OperatorOverloadingInferencingTests)  Time elapsed: 0.275 s
11-Jan-2020 05:24:40 testDivide(org.eclipse.jdt.core.groovy.tests.search.OperatorOverloadingInferencingTests)  Time elapsed: 1.273 s
11-Jan-2020 05:24:40 testMultiply(org.eclipse.jdt.core.groovy.tests.search.OperatorOverloadingInferencingTests)  Time elapsed: 0.241 s
11-Jan-2020 05:24:40 testGetAt1(org.eclipse.jdt.core.groovy.tests.search.OperatorOverloadingInferencingTests)  Time elapsed: 0.233 s
11-Jan-2020 05:24:40 testGetAt2(org.eclipse.jdt.core.groovy.tests.search.OperatorOverloadingInferencingTests)  Time elapsed: 0.254 s
11-Jan-2020 05:24:40 testGetAt3(org.eclipse.jdt.core.groovy.tests.search.OperatorOverloadingInferencingTests)  Time elapsed: 1.106 s
11-Jan-2020 05:24:40 testGetAt4(org.eclipse.jdt.core.groovy.tests.search.OperatorOverloadingInferencingTests)  Time elapsed: 0.231 s
11-Jan-2020 05:24:40 testGetAt5(org.eclipse.jdt.core.groovy.tests.search.OperatorOverloadingInferencingTests)  Time elapsed: 0.319 s
11-Jan-2020 05:24:40 testGetAt6(org.eclipse.jdt.core.groovy.tests.search.OperatorOverloadingInferencingTests)  Time elapsed: 0.248 s
11-Jan-2020 05:24:40 testGetAt7(org.eclipse.jdt.core.groovy.tests.search.OperatorOverloadingInferencingTests)  Time elapsed: 1.061 s
11-Jan-2020 05:24:40 testGetAt8(org.eclipse.jdt.core.groovy.tests.search.OperatorOverloadingInferencingTests)  Time elapsed: 0.276 s
11-Jan-2020 05:24:40 testGetAt9(org.eclipse.jdt.core.groovy.tests.search.OperatorOverloadingInferencingTests)  Time elapsed: 0.242 s
11-Jan-2020 05:24:40 testPostfix1(org.eclipse.jdt.core.groovy.tests.search.OperatorOverloadingInferencingTests)  Time elapsed: 1.055 s
11-Jan-2020 05:24:40 testPostfix2(org.eclipse.jdt.core.groovy.tests.search.OperatorOverloadingInferencingTests)  Time elapsed: 0.233 s
11-Jan-2020 05:24:40 testMinus1(org.eclipse.jdt.core.groovy.tests.search.OperatorOverloadingInferencingTests)  Time elapsed: 0.217 s
11-Jan-2020 05:24:40 testMinus2(org.eclipse.jdt.core.groovy.tests.search.OperatorOverloadingInferencingTests)  Time elapsed: 0.27 s
11-Jan-2020 05:24:40 testCompleteExpr1(org.eclipse.jdt.core.groovy.tests.search.OperatorOverloadingInferencingTests)  Time elapsed: 0.981 s
11-Jan-2020 05:24:40 testCompleteExpr2(org.eclipse.jdt.core.groovy.tests.search.OperatorOverloadingInferencingTests)  Time elapsed: 0.224 s
11-Jan-2020 05:24:40 testCompleteExpr3(org.eclipse.jdt.core.groovy.tests.search.OperatorOverloadingInferencingTests)  Time elapsed: 0.209 s
11-Jan-2020 05:24:40 testCompleteExpr4(org.eclipse.jdt.core.groovy.tests.search.OperatorOverloadingInferencingTests)  Time elapsed: 0.213 s
11-Jan-2020 05:24:40 testCompleteExpr5(org.eclipse.jdt.core.groovy.tests.search.OperatorOverloadingInferencingTests)  Time elapsed: 1.166 s
11-Jan-2020 05:24:40 testCompleteExpr6(org.eclipse.jdt.core.groovy.tests.search.OperatorOverloadingInferencingTests)  Time elapsed: 0.283 s
11-Jan-2020 05:24:40 testCompleteExpr7(org.eclipse.jdt.core.groovy.tests.search.OperatorOverloadingInferencingTests)  Time elapsed: 0.235 s
11-Jan-2020 05:24:40 testCompleteExpr8(org.eclipse.jdt.core.groovy.tests.search.OperatorOverloadingInferencingTests)  Time elapsed: 0.238 s
11-Jan-2020 05:24:40 testEqualsCheck(org.eclipse.jdt.core.groovy.tests.search.SpockInferencingTests) skipped
11-Jan-2020 05:24:40 testDataTableChecks(org.eclipse.jdt.core.groovy.tests.search.SpockInferencingTests) skipped
11-Jan-2020 05:24:40 testGetterCheck(org.eclipse.jdt.core.groovy.tests.search.SpockInferencingTests) skipped
11-Jan-2020 05:24:40 testPropertyCheck(org.eclipse.jdt.core.groovy.tests.search.SpockInferencingTests) skipped
11-Jan-2020 05:24:40 testBasics(org.eclipse.jdt.core.groovy.tests.search.SpockInferencingTests) skipped
11-Jan-2020 05:24:40 testNonStaticReference1(org.eclipse.jdt.core.groovy.tests.search.StaticInferencingTests)  Time elapsed: 0.261 s
11-Jan-2020 05:24:40 testNonStaticReference2(org.eclipse.jdt.core.groovy.tests.search.StaticInferencingTests)  Time elapsed: 0.232 s
11-Jan-2020 05:24:40 testNonStaticReference3(org.eclipse.jdt.core.groovy.tests.search.StaticInferencingTests)  Time elapsed: 1.318 s
11-Jan-2020 05:24:40 testNonStaticReference4(org.eclipse.jdt.core.groovy.tests.search.StaticInferencingTests)  Time elapsed: 0.233 s
11-Jan-2020 05:24:40 testNonStaticReference5(org.eclipse.jdt.core.groovy.tests.search.StaticInferencingTests)  Time elapsed: 0.228 s
11-Jan-2020 05:24:40 testNonStaticReference6(org.eclipse.jdt.core.groovy.tests.search.StaticInferencingTests)  Time elapsed: 1.316 s
11-Jan-2020 05:24:40 testNonStaticReference7(org.eclipse.jdt.core.groovy.tests.search.StaticInferencingTests)  Time elapsed: 0.233 s
11-Jan-2020 05:24:40 testNonStaticReference8(org.eclipse.jdt.core.groovy.tests.search.StaticInferencingTests)  Time elapsed: 0.278 s
11-Jan-2020 05:24:40 testStaticReference1(org.eclipse.jdt.core.groovy.tests.search.StaticInferencingTests)  Time elapsed: 0.24 s
11-Jan-2020 05:24:40 testStaticReference2(org.eclipse.jdt.core.groovy.tests.search.StaticInferencingTests)  Time elapsed: 1.306 s
11-Jan-2020 05:24:40 testStaticReference3(org.eclipse.jdt.core.groovy.tests.search.StaticInferencingTests)  Time elapsed: 0.294 s
11-Jan-2020 05:24:40 testStaticReference4(org.eclipse.jdt.core.groovy.tests.search.StaticInferencingTests)  Time elapsed: 0.288 s
11-Jan-2020 05:24:40 testStaticReference5(org.eclipse.jdt.core.groovy.tests.search.StaticInferencingTests)  Time elapsed: 0.269 s
11-Jan-2020 05:24:40 testStaticReference6(org.eclipse.jdt.core.groovy.tests.search.StaticInferencingTests)  Time elapsed: 1.704 s
11-Jan-2020 05:24:40 testStaticReference7(org.eclipse.jdt.core.groovy.tests.search.StaticInferencingTests)  Time elapsed: 0.258 s
11-Jan-2020 05:24:40 testStaticReference8(org.eclipse.jdt.core.groovy.tests.search.StaticInferencingTests)  Time elapsed: 0.28 s
11-Jan-2020 05:24:40 testStaticReference9(org.eclipse.jdt.core.groovy.tests.search.StaticInferencingTests)  Time elapsed: 0.228 s
11-Jan-2020 05:24:40 testStaticImport1(org.eclipse.jdt.core.groovy.tests.search.StaticInferencingTests)  Time elapsed: 1.448 s
11-Jan-2020 05:24:40 testStaticImport2(org.eclipse.jdt.core.groovy.tests.search.StaticInferencingTests)  Time elapsed: 0.234 s
11-Jan-2020 05:24:40 testStaticImport3(org.eclipse.jdt.core.groovy.tests.search.StaticInferencingTests)  Time elapsed: 0.253 s
11-Jan-2020 05:24:40 testStaticImport4(org.eclipse.jdt.core.groovy.tests.search.StaticInferencingTests)  Time elapsed: 1.545 s
11-Jan-2020 05:24:40 testStaticImport5(org.eclipse.jdt.core.groovy.tests.search.StaticInferencingTests)  Time elapsed: 0.296 s
11-Jan-2020 05:24:40 testStaticImport6(org.eclipse.jdt.core.groovy.tests.search.StaticInferencingTests)  Time elapsed: 0.299 s
11-Jan-2020 05:24:40 testStaticImport7(org.eclipse.jdt.core.groovy.tests.search.StaticInferencingTests)  Time elapsed: 0.258 s
11-Jan-2020 05:24:40 testStaticImport8(org.eclipse.jdt.core.groovy.tests.search.StaticInferencingTests)  Time elapsed: 1.435 s
11-Jan-2020 05:24:40 testStaticImport9(org.eclipse.jdt.core.groovy.tests.search.StaticInferencingTests)  Time elapsed: 0.225 s
11-Jan-2020 05:24:40 testStaticImport10(org.eclipse.jdt.core.groovy.tests.search.StaticInferencingTests)  Time elapsed: 0.222 s
11-Jan-2020 05:24:40 testStaticImport11(org.eclipse.jdt.core.groovy.tests.search.StaticInferencingTests)  Time elapsed: 0.233 s
11-Jan-2020 05:24:40 testStaticImport12(org.eclipse.jdt.core.groovy.tests.search.StaticInferencingTests)  Time elapsed: 1.224 s
11-Jan-2020 05:24:40 testStaticImport13(org.eclipse.jdt.core.groovy.tests.search.StaticInferencingTests) skipped
11-Jan-2020 05:24:40 testStaticImport14(org.eclipse.jdt.core.groovy.tests.search.StaticInferencingTests) skipped
11-Jan-2020 05:24:40 testStaticImport15(org.eclipse.jdt.core.groovy.tests.search.StaticInferencingTests) skipped
11-Jan-2020 05:24:40 testClassReference16a(org.eclipse.jdt.core.groovy.tests.search.StaticInferencingTests)  Time elapsed: 0.21 s
11-Jan-2020 05:24:40 testClassReference17a(org.eclipse.jdt.core.groovy.tests.search.StaticInferencingTests)  Time elapsed: 0.218 s
11-Jan-2020 05:24:40 testStaticReference10a(org.eclipse.jdt.core.groovy.tests.search.StaticInferencingTests)  Time elapsed: 0.205 s
11-Jan-2020 05:24:40 testClassReference10(org.eclipse.jdt.core.groovy.tests.search.StaticInferencingTests)  Time elapsed: 0.943 s
11-Jan-2020 05:24:40 testClassReference11(org.eclipse.jdt.core.groovy.tests.search.StaticInferencingTests)  Time elapsed: 0.221 s
11-Jan-2020 05:24:40 testClassReference12(org.eclipse.jdt.core.groovy.tests.search.StaticInferencingTests)  Time elapsed: 0.225 s
11-Jan-2020 05:24:40 testClassReference13(org.eclipse.jdt.core.groovy.tests.search.StaticInferencingTests)  Time elapsed: 0.25 s
11-Jan-2020 05:24:40 testClassReference14(org.eclipse.jdt.core.groovy.tests.search.StaticInferencingTests)  Time elapsed: 0.979 s
11-Jan-2020 05:24:40 testClassReference15(org.eclipse.jdt.core.groovy.tests.search.StaticInferencingTests)  Time elapsed: 0.209 s
11-Jan-2020 05:24:40 testClassReference16(org.eclipse.jdt.core.groovy.tests.search.StaticInferencingTests)  Time elapsed: 0.227 s
11-Jan-2020 05:24:40 testClassReference17(org.eclipse.jdt.core.groovy.tests.search.StaticInferencingTests)  Time elapsed: 0.227 s
11-Jan-2020 05:24:40 testClassReference4a(org.eclipse.jdt.core.groovy.tests.search.StaticInferencingTests)  Time elapsed: 0.238 s
11-Jan-2020 05:24:40 testStaticReference10(org.eclipse.jdt.core.groovy.tests.search.StaticInferencingTests)  Time elapsed: 0.944 s
11-Jan-2020 05:24:40 testStaticReference1a(org.eclipse.jdt.core.groovy.tests.search.StaticInferencingTests)  Time elapsed: 0.223 s
11-Jan-2020 05:24:40 testStaticReference1b(org.eclipse.jdt.core.groovy.tests.search.StaticInferencingTests)  Time elapsed: 0.243 s
11-Jan-2020 05:24:40 testStaticReference9a(org.eclipse.jdt.core.groovy.tests.search.StaticInferencingTests)  Time elapsed: 0.21 s
11-Jan-2020 05:24:40 testClassReference1(org.eclipse.jdt.core.groovy.tests.search.StaticInferencingTests)  Time elapsed: 0.978 s
11-Jan-2020 05:24:40 testClassReference2(org.eclipse.jdt.core.groovy.tests.search.StaticInferencingTests)  Time elapsed: 0.225 s
11-Jan-2020 05:24:40 testClassReference3(org.eclipse.jdt.core.groovy.tests.search.StaticInferencingTests)  Time elapsed: 0.221 s
11-Jan-2020 05:24:40 testClassReference4(org.eclipse.jdt.core.groovy.tests.search.StaticInferencingTests)  Time elapsed: 0.24 s
11-Jan-2020 05:24:40 testClassReference5(org.eclipse.jdt.core.groovy.tests.search.StaticInferencingTests)  Time elapsed: 1.219 s
11-Jan-2020 05:24:40 testClassReference6(org.eclipse.jdt.core.groovy.tests.search.StaticInferencingTests)  Time elapsed: 0.225 s
11-Jan-2020 05:24:40 testClassReference7(org.eclipse.jdt.core.groovy.tests.search.StaticInferencingTests)  Time elapsed: 0.229 s
11-Jan-2020 05:24:40 testClassReference8(org.eclipse.jdt.core.groovy.tests.search.StaticInferencingTests)  Time elapsed: 0.236 s
11-Jan-2020 05:24:40 testClassReference9(org.eclipse.jdt.core.groovy.tests.search.StaticInferencingTests)  Time elapsed: 0.924 s
11-Jan-2020 05:24:40 testSyntheticAccessors1(org.eclipse.jdt.core.groovy.tests.search.SyntheticAccessorInferencingTests)  Time elapsed: 0.316 s
11-Jan-2020 05:24:40 testSyntheticAccessors2(org.eclipse.jdt.core.groovy.tests.search.SyntheticAccessorInferencingTests)  Time elapsed: 0.294 s
11-Jan-2020 05:24:40 testSyntheticAccessors3(org.eclipse.jdt.core.groovy.tests.search.SyntheticAccessorInferencingTests)  Time elapsed: 1.444 s
11-Jan-2020 05:24:40 testSyntheticAccessors4(org.eclipse.jdt.core.groovy.tests.search.SyntheticAccessorInferencingTests)  Time elapsed: 4.811 s
11-Jan-2020 05:24:40 testPublicStaticSuperMethod1(org.eclipse.jdt.core.groovy.tests.search.TraitInferencingTests)  Time elapsed: 0.338 s
11-Jan-2020 05:24:40 testPublicStaticSuperMethod2(org.eclipse.jdt.core.groovy.tests.search.TraitInferencingTests)  Time elapsed: 0.311 s
11-Jan-2020 05:24:40 testProperty10(org.eclipse.jdt.core.groovy.tests.search.TraitInferencingTests)  Time elapsed: 0.283 s
11-Jan-2020 05:24:40 testProperty11(org.eclipse.jdt.core.groovy.tests.search.TraitInferencingTests)  Time elapsed: 1.504 s
11-Jan-2020 05:24:40 testProperty12(org.eclipse.jdt.core.groovy.tests.search.TraitInferencingTests)  Time elapsed: 0.277 s
11-Jan-2020 05:24:40 testProperty13(org.eclipse.jdt.core.groovy.tests.search.TraitInferencingTests)  Time elapsed: 0.239 s
11-Jan-2020 05:24:40 testProperty14(org.eclipse.jdt.core.groovy.tests.search.TraitInferencingTests)  Time elapsed: 1.114 s
11-Jan-2020 05:24:40 testPrivateStaticField(org.eclipse.jdt.core.groovy.tests.search.TraitInferencingTests)  Time elapsed: 0.314 s
11-Jan-2020 05:24:40 testPrivateMethod1(org.eclipse.jdt.core.groovy.tests.search.TraitInferencingTests)  Time elapsed: 0.3 s
11-Jan-2020 05:24:40 testPrivateMethod2(org.eclipse.jdt.core.groovy.tests.search.TraitInferencingTests)  Time elapsed: 1.363 s
11-Jan-2020 05:24:40 testPrivateMethod3(org.eclipse.jdt.core.groovy.tests.search.TraitInferencingTests)  Time elapsed: 0.301 s
11-Jan-2020 05:24:40 testPrivateMethod4(org.eclipse.jdt.core.groovy.tests.search.TraitInferencingTests)  Time elapsed: 0.278 s
11-Jan-2020 05:24:40 testPublicStaticField(org.eclipse.jdt.core.groovy.tests.search.TraitInferencingTests)  Time elapsed: 1.383 s
11-Jan-2020 05:24:40 testPublicMethod1(org.eclipse.jdt.core.groovy.tests.search.TraitInferencingTests)  Time elapsed: 0.277 s
11-Jan-2020 05:24:40 testPublicMethod2(org.eclipse.jdt.core.groovy.tests.search.TraitInferencingTests)  Time elapsed: 0.331 s
11-Jan-2020 05:24:40 testPublicMethod3(org.eclipse.jdt.core.groovy.tests.search.TraitInferencingTests)  Time elapsed: 1.038 s
11-Jan-2020 05:24:40 testPublicMethod4(org.eclipse.jdt.core.groovy.tests.search.TraitInferencingTests)  Time elapsed: 0.319 s
11-Jan-2020 05:24:40 testPrivateStaticMethod(org.eclipse.jdt.core.groovy.tests.search.TraitInferencingTests)  Time elapsed: 0.27 s
11-Jan-2020 05:24:40 testProperty1(org.eclipse.jdt.core.groovy.tests.search.TraitInferencingTests)  Time elapsed: 1.154 s
11-Jan-2020 05:24:40 testProperty2(org.eclipse.jdt.core.groovy.tests.search.TraitInferencingTests)  Time elapsed: 0.275 s
11-Jan-2020 05:24:40 testProperty3(org.eclipse.jdt.core.groovy.tests.search.TraitInferencingTests)  Time elapsed: 0.282 s
11-Jan-2020 05:24:40 testProperty4(org.eclipse.jdt.core.groovy.tests.search.TraitInferencingTests)  Time elapsed: 0.29 s
11-Jan-2020 05:24:40 testProperty5(org.eclipse.jdt.core.groovy.tests.search.TraitInferencingTests)  Time elapsed: 1.481 s
11-Jan-2020 05:24:40 testProperty6(org.eclipse.jdt.core.groovy.tests.search.TraitInferencingTests)  Time elapsed: 0.275 s
11-Jan-2020 05:24:40 testProperty7(org.eclipse.jdt.core.groovy.tests.search.TraitInferencingTests)  Time elapsed: 0.295 s
11-Jan-2020 05:24:40 testProperty8(org.eclipse.jdt.core.groovy.tests.search.TraitInferencingTests)  Time elapsed: 1.127 s
11-Jan-2020 05:24:40 testProperty9(org.eclipse.jdt.core.groovy.tests.search.TraitInferencingTests)  Time elapsed: 0.336 s
11-Jan-2020 05:24:40 testPublicStaticFinalField(org.eclipse.jdt.core.groovy.tests.search.TraitInferencingTests)  Time elapsed: 0.27 s
11-Jan-2020 05:24:40 testPublicField1(org.eclipse.jdt.core.groovy.tests.search.TraitInferencingTests)  Time elapsed: 1.155 s
11-Jan-2020 05:24:40 testPublicField2(org.eclipse.jdt.core.groovy.tests.search.TraitInferencingTests)  Time elapsed: 0.284 s
11-Jan-2020 05:24:40 testPrivateStaticFinalField(org.eclipse.jdt.core.groovy.tests.search.TraitInferencingTests)  Time elapsed: 0.266 s
11-Jan-2020 05:24:40 testPrivateField1(org.eclipse.jdt.core.groovy.tests.search.TraitInferencingTests)  Time elapsed: 1.316 s
11-Jan-2020 05:24:40 testPrivateField2(org.eclipse.jdt.core.groovy.tests.search.TraitInferencingTests)  Time elapsed: 0.294 s
11-Jan-2020 05:24:40 testFindClassDeclarationWithPattern(org.eclipse.jdt.core.groovy.tests.search.TypeReferenceSearchTests)  Time elapsed: 0.458 s
11-Jan-2020 05:24:40 testInnerTypes1(org.eclipse.jdt.core.groovy.tests.search.TypeReferenceSearchTests)  Time elapsed: 1.153 s
11-Jan-2020 05:24:40 testInnerTypes2(org.eclipse.jdt.core.groovy.tests.search.TypeReferenceSearchTests)  Time elapsed: 2.315 s
11-Jan-2020 05:24:40 testInnerTypes3(org.eclipse.jdt.core.groovy.tests.search.TypeReferenceSearchTests)  Time elapsed: 1.15 s
11-Jan-2020 05:24:40 testSearchForTypesScript1(org.eclipse.jdt.core.groovy.tests.search.TypeReferenceSearchTests)  Time elapsed: 0.255 s
11-Jan-2020 05:24:40 testSearchForTypesScript2(org.eclipse.jdt.core.groovy.tests.search.TypeReferenceSearchTests)  Time elapsed: 0.219 s
11-Jan-2020 05:24:40 testSearchForTypesScript3(org.eclipse.jdt.core.groovy.tests.search.TypeReferenceSearchTests)  Time elapsed: 1.07 s
11-Jan-2020 05:24:40 testSearchForTypesScript4(org.eclipse.jdt.core.groovy.tests.search.TypeReferenceSearchTests)  Time elapsed: 0.21 s
11-Jan-2020 05:24:40 testSearchForTypesScript5(org.eclipse.jdt.core.groovy.tests.search.TypeReferenceSearchTests)  Time elapsed: 0.223 s
11-Jan-2020 05:24:40 testSearchForTypesScript6(org.eclipse.jdt.core.groovy.tests.search.TypeReferenceSearchTests)  Time elapsed: 0.23 s
11-Jan-2020 05:24:40 testShouldntFindClassDeclarationInScript(org.eclipse.jdt.core.groovy.tests.search.TypeReferenceSearchTests)  Time elapsed: 0.273 s
11-Jan-2020 05:24:40 testSearchForTypesArray1(org.eclipse.jdt.core.groovy.tests.search.TypeReferenceSearchTests)  Time elapsed: 1.104 s
11-Jan-2020 05:24:40 testSearchForTypesClass1(org.eclipse.jdt.core.groovy.tests.search.TypeReferenceSearchTests)  Time elapsed: 0.102 s
11-Jan-2020 05:24:40 testSearchForTypesClass2(org.eclipse.jdt.core.groovy.tests.search.TypeReferenceSearchTests)  Time elapsed: 0.167 s
11-Jan-2020 05:24:40 testSearchForTypesClass3(org.eclipse.jdt.core.groovy.tests.search.TypeReferenceSearchTests)  Time elapsed: 0.194 s
11-Jan-2020 05:24:40 testSearchForTypesClass4(org.eclipse.jdt.core.groovy.tests.search.TypeReferenceSearchTests)  Time elapsed: 0.163 s
11-Jan-2020 05:24:40 testSearchForTypesClass5(org.eclipse.jdt.core.groovy.tests.search.TypeReferenceSearchTests)  Time elapsed: 1.3 s
11-Jan-2020 05:24:40 testSearchForTypesClass6(org.eclipse.jdt.core.groovy.tests.search.TypeReferenceSearchTests)  Time elapsed: 0.159 s
11-Jan-2020 05:24:40 testSearchForTypesClass7(org.eclipse.jdt.core.groovy.tests.search.TypeReferenceSearchTests)  Time elapsed: 0.247 s
11-Jan-2020 05:24:40 testSearchForTypesClosure1(org.eclipse.jdt.core.groovy.tests.search.TypeReferenceSearchTests)  Time elapsed: 0.27 s
11-Jan-2020 05:24:40 testSearchForTypesClosure2(org.eclipse.jdt.core.groovy.tests.search.TypeReferenceSearchTests)  Time elapsed: 0.265 s
11-Jan-2020 05:24:40 testSearchForTypesClosure3(org.eclipse.jdt.core.groovy.tests.search.TypeReferenceSearchTests)  Time elapsed: 1.037 s
11-Jan-2020 05:24:40 testCoercion1(org.eclipse.jdt.core.groovy.tests.search.TypeReferenceSearchTests)  Time elapsed: 0.175 s
11-Jan-2020 05:24:40 testGenerics1(org.eclipse.jdt.core.groovy.tests.search.TypeReferenceSearchTests)  Time elapsed: 0.103 s
11-Jan-2020 05:24:40 testFindClassDeclaration(org.eclipse.jdt.core.groovy.tests.search.TypeReferenceSearchTests)  Time elapsed: 0.099 s
11-Jan-2020 05:24:40 testConstructorWithDefaultArgsInCompileStatic(org.eclipse.jdt.core.groovy.tests.search.TypeReferenceSearchTests)  Time elapsed: 0.86 s
11-Jan-2020 05:24:40
11-Jan-2020 05:24:40 Results:
11-Jan-2020 05:24:40
11-Jan-2020 05:24:40 Failures:
11-Jan-2020 05:24:40   BuildAccessRulesTests.testAccessForLazyProperty:176->assertAccessRestriction:80->BuilderTestSuite.expectingProblemsFor:235->BuilderTestSuite.expectingProblemsFor:240
11-Jan-2020 05:24:40 ----------- Expected ------------
11-Jan-2020 05:24:40 Problem : Access restriction: The type 'BeanInfo' is not API (restriction on required library '##') [ resource : </Project/src/Foo.groovy> range : <49,57> category : <150> severity : <2>]
11-Jan-2020 05:24:40
11-Jan-2020 05:24:40 ------------ but was ------------
11-Jan-2020 05:24:40
11-Jan-2020 05:24:40 --------- Difference is ----------
11-Jan-2020 05:24:40 expected:<[Problem : Access restriction: The type 'BeanInfo' is not API (restriction on required library '##') [ resource : </Project/src/Foo.groovy> range : <49,57> category : <150> severity : <2>]
11-Jan-2020 05:24:40 ]> but was:<[]>
11-Jan-2020 05:24:40   ConstructorReferenceSearchTests.testConstructorReferences2:96 Incorrect number of matches; expected:<1> but was:<0>
11-Jan-2020 05:24:40   InferencingTests.testLocalTypeAndDefaultImportCollision:3175->InferencingTestSuite.assertType:61->InferencingTestSuite.assertType:66->InferencingTestSuite.assertType:85 Expected type not found.
11-Jan-2020 05:24:40 Expected: domain.Calendar
11-Jan-2020 05:24:40 Found: java.lang.String
11-Jan-2020 05:24:40 Declaring type: Search
11-Jan-2020 05:24:40 ASTNode: org.codehaus.groovy.ast.expr.VariableExpression@e9ecc[variable: cal]
11-Jan-2020 05:24:40 Confidence: INFERRED
11-Jan-2020 05:24:40
11-Jan-2020 05:24:40
11-Jan-2020 05:24:40 Tests run: 6280, Failures: 3, Errors: 0, Skipped: 140
11-Jan-2020 05:24:40
11-Jan-2020 05:24:44
11-Jan-2020 05:24:44 !ENTRY org.eclipse.core.resources 2 10035 2020-01-11 05:24:44.957
11-Jan-2020 05:24:44 !MESSAGE The workspace will exit with unsaved changes in this session.
11-Jan-2020 05:24:45 [ERROR] There are test failures.
11-Jan-2020 05:24:45
11-Jan-2020 05:24:45 Please refer to /opt/bamboo-home/xml-data/build-dir/GRECLIPSE-E413-JOB1/ide-test/org.codehaus.groovy.alltests/target/surefire-reports for the individual test results.
11-Jan-2020 05:24:45 [INFO]
11-Jan-2020 05:24:45 [INFO] --- maven-install-plugin:2.3.1:install (default-install) @ org.codehaus.groovy.alltests ---
11-Jan-2020 05:24:45 [INFO] Installing /opt/bamboo-home/xml-data/build-dir/GRECLIPSE-E413-JOB1/ide-test/org.codehaus.groovy.alltests/target/org.codehaus.groovy.alltests-3.7.0-SNAPSHOT.jar to /home/bamboo/.m2/repository/org/codehaus/groovy/eclipse/org.codehaus.groovy.alltests/3.7.0-SNAPSHOT/org.codehaus.groovy.alltests-3.7.0-SNAPSHOT.jar
11-Jan-2020 05:24:45 [INFO] Installing /opt/bamboo-home/xml-data/build-dir/GRECLIPSE-E413-JOB1/ide-test/org.codehaus.groovy.alltests/pom.xml to /home/bamboo/.m2/repository/org/codehaus/groovy/eclipse/org.codehaus.groovy.alltests/3.7.0-SNAPSHOT/org.codehaus.groovy.alltests-3.7.0-SNAPSHOT.pom
11-Jan-2020 05:24:45 [INFO] Installing /opt/bamboo-home/xml-data/build-dir/GRECLIPSE-E413-JOB1/ide-test/org.codehaus.groovy.alltests/target/org.codehaus.groovy.alltests-3.7.0-SNAPSHOT-sources.jar to /home/bamboo/.m2/repository/org/codehaus/groovy/eclipse/org.codehaus.groovy.alltests/3.7.0-SNAPSHOT/org.codehaus.groovy.alltests-3.7.0-SNAPSHOT-sources.jar
11-Jan-2020 05:24:45 [INFO] Installing /opt/bamboo-home/xml-data/build-dir/GRECLIPSE-E413-JOB1/ide-test/org.codehaus.groovy.alltests/target/p2content.xml to /home/bamboo/.m2/repository/org/codehaus/groovy/eclipse/org.codehaus.groovy.alltests/3.7.0-SNAPSHOT/org.codehaus.groovy.alltests-3.7.0-SNAPSHOT-p2metadata.xml
11-Jan-2020 05:24:45 [INFO] Installing /opt/bamboo-home/xml-data/build-dir/GRECLIPSE-E413-JOB1/ide-test/org.codehaus.groovy.alltests/target/p2artifacts.xml to /home/bamboo/.m2/repository/org/codehaus/groovy/eclipse/org.codehaus.groovy.alltests/3.7.0-SNAPSHOT/org.codehaus.groovy.alltests-3.7.0-SNAPSHOT-p2artifacts.xml
11-Jan-2020 05:24:45 [INFO] Installing /opt/bamboo-home/xml-data/build-dir/GRECLIPSE-E413-JOB1/ide-test/org.codehaus.groovy.alltests/target/p2content.xml to /home/bamboo/.m2/repository/org/codehaus/groovy/eclipse/org.codehaus.groovy.alltests/3.7.0-SNAPSHOT/org.codehaus.groovy.alltests-3.7.0-SNAPSHOT-p2metadata.xml
11-Jan-2020 05:24:45 [INFO] Installing /opt/bamboo-home/xml-data/build-dir/GRECLIPSE-E413-JOB1/ide-test/org.codehaus.groovy.alltests/target/p2artifacts.xml to /home/bamboo/.m2/repository/org/codehaus/groovy/eclipse/org.codehaus.groovy.alltests/3.7.0-SNAPSHOT/org.codehaus.groovy.alltests-3.7.0-SNAPSHOT-p2artifacts.xml
11-Jan-2020 05:24:45 [INFO]
11-Jan-2020 05:24:45 [INFO] --- tycho-p2-plugin:1.5.0:update-local-index (default-update-local-index) @ org.codehaus.groovy.alltests ---
11-Jan-2020 05:24:45 [INFO]
11-Jan-2020 05:24:45 [INFO] --- maven-deploy-plugin:2.8.2:deploy (default-deploy) @ org.codehaus.groovy.alltests ---
11-Jan-2020 05:24:45 [INFO] Skipping artifact deployment
11-Jan-2020 05:24:45 [INFO]
11-Jan-2020 05:24:45 [INFO] -----< org.codehaus.groovy.eclipse:org.codehaus.groovy.m2eclipse >------
11-Jan-2020 05:24:45 [INFO] Building org.codehaus.groovy.m2eclipse 3.7.0-SNAPSHOT            [38/40]
11-Jan-2020 05:24:45 [INFO] ---------------------------[ eclipse-plugin ]---------------------------
11-Jan-2020 05:24:45 [INFO]
11-Jan-2020 05:24:45 [INFO] --- maven-clean-plugin:2.5:clean (default-clean) @ org.codehaus.groovy.m2eclipse ---
11-Jan-2020 05:24:45 [INFO]
11-Jan-2020 05:24:45 [INFO] --- tycho-packaging-plugin:1.5.0:build-qualifier (default-build-qualifier) @ org.codehaus.groovy.m2eclipse ---
11-Jan-2020 05:24:45 [INFO] The project's OSGi version is 3.7.0.v202001110351-e1909
11-Jan-2020 05:24:45 [INFO]
11-Jan-2020 05:24:45 [INFO] --- tycho-packaging-plugin:1.5.0:validate-id (default-validate-id) @ org.codehaus.groovy.m2eclipse ---
11-Jan-2020 05:24:45 [INFO]
11-Jan-2020 05:24:45 [INFO] --- tycho-packaging-plugin:1.5.0:validate-version (default-validate-version) @ org.codehaus.groovy.m2eclipse ---
11-Jan-2020 05:24:45 [INFO]
11-Jan-2020 05:24:45 [INFO] --- properties-maven-plugin:1.0.0:read-project-properties (default) @ org.codehaus.groovy.m2eclipse ---
11-Jan-2020 05:24:45 [INFO]
11-Jan-2020 05:24:45 [INFO] --- maven-resources-plugin:2.4.3:resources (default-resources) @ org.codehaus.groovy.m2eclipse ---
11-Jan-2020 05:24:45 [INFO] Using 'UTF-8' encoding to copy filtered resources.
11-Jan-2020 05:24:45 [INFO] skip non existing resourceDirectory /opt/bamboo-home/xml-data/build-dir/GRECLIPSE-E413-JOB1/extras/org.codehaus.groovy.m2eclipse/src/main/resources
11-Jan-2020 05:24:45 [INFO]
11-Jan-2020 05:24:45 [INFO] --- tycho-compiler-plugin:1.5.0:compile (default-compile) @ org.codehaus.groovy.m2eclipse ---
11-Jan-2020 05:24:45 [INFO] Compiling 2 source files to /opt/bamboo-home/xml-data/build-dir/GRECLIPSE-E413-JOB1/extras/org.codehaus.groovy.m2eclipse/target/classes
11-Jan-2020 05:24:45 [INFO]
11-Jan-2020 05:24:45 [INFO] --- maven-resources-plugin:2.4.3:testResources (default-testResources) @ org.codehaus.groovy.m2eclipse ---
11-Jan-2020 05:24:45 [INFO] Using 'UTF-8' encoding to copy filtered resources.
11-Jan-2020 05:24:45 [INFO] skip non existing resourceDirectory /opt/bamboo-home/xml-data/build-dir/GRECLIPSE-E413-JOB1/extras/org.codehaus.groovy.m2eclipse/src/test/resources
11-Jan-2020 05:24:45 [INFO]
11-Jan-2020 05:24:45 [INFO] --- tycho-source-plugin:1.5.0:plugin-source (plugin-source) @ org.codehaus.groovy.m2eclipse ---
11-Jan-2020 05:24:45 [INFO] Building jar: /opt/bamboo-home/xml-data/build-dir/GRECLIPSE-E413-JOB1/extras/org.codehaus.groovy.m2eclipse/target/org.codehaus.groovy.m2eclipse-3.7.0-SNAPSHOT-sources.jar
11-Jan-2020 05:24:45 [INFO]
11-Jan-2020 05:24:45 [INFO] --- target-platform-configuration:1.5.0:target-platform (default-target-platform) @ org.codehaus.groovy.m2eclipse ---
11-Jan-2020 05:24:45 [INFO]
11-Jan-2020 05:24:45 [INFO] --- tycho-packaging-plugin:1.5.0:package-plugin (default-package-plugin) @ org.codehaus.groovy.m2eclipse ---
11-Jan-2020 05:24:45 [INFO] Building jar: /opt/bamboo-home/xml-data/build-dir/GRECLIPSE-E413-JOB1/extras/org.codehaus.groovy.m2eclipse/target/org.codehaus.groovy.m2eclipse-3.7.0-SNAPSHOT.jar
11-Jan-2020 05:24:45 [INFO]
11-Jan-2020 05:24:45 [INFO] --- tycho-p2-plugin:1.5.0:p2-metadata-default (default-p2-metadata-default) @ org.codehaus.groovy.m2eclipse ---
11-Jan-2020 05:24:45 [INFO]
11-Jan-2020 05:24:45 [INFO] --- maven-jarsigner-plugin:3.0.0:sign (sign) @ org.codehaus.groovy.m2eclipse ---
11-Jan-2020 05:24:46 [INFO] 2 archive(s) processed
11-Jan-2020 05:24:46 [INFO]
11-Jan-2020 05:24:46 [INFO] --- tycho-source-feature-plugin:1.5.0:source-feature (source-feature) @ org.codehaus.groovy.m2eclipse ---
11-Jan-2020 05:24:46 [INFO]
11-Jan-2020 05:24:46 [INFO] --- tycho-p2-plugin:1.5.0:p2-metadata (attach-p2-metadata) @ org.codehaus.groovy.m2eclipse ---
11-Jan-2020 05:24:46 [INFO]
11-Jan-2020 05:24:46 [INFO] --- maven-install-plugin:2.3.1:install (default-install) @ org.codehaus.groovy.m2eclipse ---
11-Jan-2020 05:24:46 [INFO] Installing /opt/bamboo-home/xml-data/build-dir/GRECLIPSE-E413-JOB1/extras/org.codehaus.groovy.m2eclipse/target/org.codehaus.groovy.m2eclipse-3.7.0-SNAPSHOT.jar to /home/bamboo/.m2/repository/org/codehaus/groovy/eclipse/org.codehaus.groovy.m2eclipse/3.7.0-SNAPSHOT/org.codehaus.groovy.m2eclipse-3.7.0-SNAPSHOT.jar
11-Jan-2020 05:24:46 [INFO] Installing /opt/bamboo-home/xml-data/build-dir/GRECLIPSE-E413-JOB1/extras/org.codehaus.groovy.m2eclipse/pom.xml to /home/bamboo/.m2/repository/org/codehaus/groovy/eclipse/org.codehaus.groovy.m2eclipse/3.7.0-SNAPSHOT/org.codehaus.groovy.m2eclipse-3.7.0-SNAPSHOT.pom
11-Jan-2020 05:24:46 [INFO] Installing /opt/bamboo-home/xml-data/build-dir/GRECLIPSE-E413-JOB1/extras/org.codehaus.groovy.m2eclipse/target/org.codehaus.groovy.m2eclipse-3.7.0-SNAPSHOT-sources.jar to /home/bamboo/.m2/repository/org/codehaus/groovy/eclipse/org.codehaus.groovy.m2eclipse/3.7.0-SNAPSHOT/org.codehaus.groovy.m2eclipse-3.7.0-SNAPSHOT-sources.jar
11-Jan-2020 05:24:46 [INFO] Installing /opt/bamboo-home/xml-data/build-dir/GRECLIPSE-E413-JOB1/extras/org.codehaus.groovy.m2eclipse/target/p2content.xml to /home/bamboo/.m2/repository/org/codehaus/groovy/eclipse/org.codehaus.groovy.m2eclipse/3.7.0-SNAPSHOT/org.codehaus.groovy.m2eclipse-3.7.0-SNAPSHOT-p2metadata.xml
11-Jan-2020 05:24:46 [INFO] Installing /opt/bamboo-home/xml-data/build-dir/GRECLIPSE-E413-JOB1/extras/org.codehaus.groovy.m2eclipse/target/p2artifacts.xml to /home/bamboo/.m2/repository/org/codehaus/groovy/eclipse/org.codehaus.groovy.m2eclipse/3.7.0-SNAPSHOT/org.codehaus.groovy.m2eclipse-3.7.0-SNAPSHOT-p2artifacts.xml
11-Jan-2020 05:24:46 [INFO] Installing /opt/bamboo-home/xml-data/build-dir/GRECLIPSE-E413-JOB1/extras/org.codehaus.groovy.m2eclipse/target/p2content.xml to /home/bamboo/.m2/repository/org/codehaus/groovy/eclipse/org.codehaus.groovy.m2eclipse/3.7.0-SNAPSHOT/org.codehaus.groovy.m2eclipse-3.7.0-SNAPSHOT-p2metadata.xml
11-Jan-2020 05:24:46 [INFO] Installing /opt/bamboo-home/xml-data/build-dir/GRECLIPSE-E413-JOB1/extras/org.codehaus.groovy.m2eclipse/target/p2artifacts.xml to /home/bamboo/.m2/repository/org/codehaus/groovy/eclipse/org.codehaus.groovy.m2eclipse/3.7.0-SNAPSHOT/org.codehaus.groovy.m2eclipse-3.7.0-SNAPSHOT-p2artifacts.xml
11-Jan-2020 05:24:46 [INFO]
11-Jan-2020 05:24:46 [INFO] --- tycho-p2-plugin:1.5.0:update-local-index (default-update-local-index) @ org.codehaus.groovy.m2eclipse ---
11-Jan-2020 05:24:46 [INFO]
11-Jan-2020 05:24:46 [INFO] --- maven-deploy-plugin:2.8.2:deploy (default-deploy) @ org.codehaus.groovy.m2eclipse ---
11-Jan-2020 05:24:46 [INFO] Skipping artifact deployment
11-Jan-2020 05:24:46 [INFO]
11-Jan-2020 05:24:46 [INFO] --< org.codehaus.groovy.eclipse:org.codehaus.groovy.m2eclipse.feature >--
11-Jan-2020 05:24:46 [INFO] Building org.codehaus.groovy.m2eclipse.feature 3.7.0-SNAPSHOT    [39/40]
11-Jan-2020 05:24:46 [INFO] --------------------------[ eclipse-feature ]---------------------------
11-Jan-2020 05:24:46 [INFO]
11-Jan-2020 05:24:46 [INFO] --- maven-clean-plugin:2.5:clean (default-clean) @ org.codehaus.groovy.m2eclipse.feature ---
11-Jan-2020 05:24:46 [INFO] Deleting /opt/bamboo-home/xml-data/build-dir/GRECLIPSE-E413-JOB1/extras/Feature-org.codehaus.groovy.m2eclipse/target
11-Jan-2020 05:24:46 [INFO]
11-Jan-2020 05:24:46 [INFO] --- tycho-packaging-plugin:1.5.0:build-qualifier-aggregator (default-build-qualifier-aggregator) @ org.codehaus.groovy.m2eclipse.feature ---
11-Jan-2020 05:24:46 [INFO] The project's OSGi version is 3.7.0.v202001110351-e1909
11-Jan-2020 05:24:46 [INFO]
11-Jan-2020 05:24:46 [INFO] --- tycho-packaging-plugin:1.5.0:validate-id (default-validate-id) @ org.codehaus.groovy.m2eclipse.feature ---
11-Jan-2020 05:24:46 [INFO]
11-Jan-2020 05:24:46 [INFO] --- tycho-packaging-plugin:1.5.0:validate-version (default-validate-version) @ org.codehaus.groovy.m2eclipse.feature ---
11-Jan-2020 05:24:46 [INFO]
11-Jan-2020 05:24:46 [INFO] --- properties-maven-plugin:1.0.0:read-project-properties (default) @ org.codehaus.groovy.m2eclipse.feature ---
11-Jan-2020 05:24:46 [INFO]
11-Jan-2020 05:24:46 [INFO] --- tycho-source-plugin:1.5.0:plugin-source (plugin-source) @ org.codehaus.groovy.m2eclipse.feature ---
11-Jan-2020 05:24:46 [INFO]
11-Jan-2020 05:24:46 [INFO] --- target-platform-configuration:1.5.0:target-platform (default-target-platform) @ org.codehaus.groovy.m2eclipse.feature ---
11-Jan-2020 05:24:46 [INFO]
11-Jan-2020 05:24:46 [INFO] --- tycho-packaging-plugin:1.5.0:package-feature (default-package-feature) @ org.codehaus.groovy.m2eclipse.feature ---
11-Jan-2020 05:24:46 [INFO] Building jar: /opt/bamboo-home/xml-data/build-dir/GRECLIPSE-E413-JOB1/extras/Feature-org.codehaus.groovy.m2eclipse/target/org.codehaus.groovy.m2eclipse.feature-3.7.0-SNAPSHOT.jar
11-Jan-2020 05:24:46 [INFO]
11-Jan-2020 05:24:46 [INFO] --- tycho-p2-plugin:1.5.0:p2-metadata-default (default-p2-metadata-default) @ org.codehaus.groovy.m2eclipse.feature ---
11-Jan-2020 05:24:46 [INFO]
11-Jan-2020 05:24:46 [INFO] --- tycho-p2-plugin:1.5.0:feature-p2-metadata (default-feature-p2-metadata) @ org.codehaus.groovy.m2eclipse.feature ---
11-Jan-2020 05:24:46 [INFO]
11-Jan-2020 05:24:46 [INFO] --- maven-jarsigner-plugin:3.0.0:sign (sign) @ org.codehaus.groovy.m2eclipse.feature ---
11-Jan-2020 05:24:46 [INFO] 1 archive(s) processed
11-Jan-2020 05:24:46 [INFO]
11-Jan-2020 05:24:46 [INFO] --- tycho-source-feature-plugin:1.5.0:source-feature (source-feature) @ org.codehaus.groovy.m2eclipse.feature ---
11-Jan-2020 05:24:46 [INFO] Building jar: /opt/bamboo-home/xml-data/build-dir/GRECLIPSE-E413-JOB1/extras/Feature-org.codehaus.groovy.m2eclipse/target/org.codehaus.groovy.m2eclipse.feature-3.7.0-SNAPSHOT-sources-feature.jar
11-Jan-2020 05:24:46 [INFO]
11-Jan-2020 05:24:46 [INFO] --- tycho-p2-plugin:1.5.0:p2-metadata (attach-p2-metadata) @ org.codehaus.groovy.m2eclipse.feature ---
11-Jan-2020 05:24:46 [INFO]
11-Jan-2020 05:24:46 [INFO] --- maven-install-plugin:2.3.1:install (default-install) @ org.codehaus.groovy.m2eclipse.feature ---
11-Jan-2020 05:24:46 [INFO] Installing /opt/bamboo-home/xml-data/build-dir/GRECLIPSE-E413-JOB1/extras/Feature-org.codehaus.groovy.m2eclipse/target/org.codehaus.groovy.m2eclipse.feature-3.7.0-SNAPSHOT.jar to /home/bamboo/.m2/repository/org/codehaus/groovy/eclipse/org.codehaus.groovy.m2eclipse.feature/3.7.0-SNAPSHOT/org.codehaus.groovy.m2eclipse.feature-3.7.0-SNAPSHOT.jar
11-Jan-2020 05:24:46 [INFO] Installing /opt/bamboo-home/xml-data/build-dir/GRECLIPSE-E413-JOB1/extras/Feature-org.codehaus.groovy.m2eclipse/pom.xml to /home/bamboo/.m2/repository/org/codehaus/groovy/eclipse/org.codehaus.groovy.m2eclipse.feature/3.7.0-SNAPSHOT/org.codehaus.groovy.m2eclipse.feature-3.7.0-SNAPSHOT.pom
11-Jan-2020 05:24:46 [INFO] Installing /opt/bamboo-home/xml-data/build-dir/GRECLIPSE-E413-JOB1/extras/Feature-org.codehaus.groovy.m2eclipse/target/p2content.xml to /home/bamboo/.m2/repository/org/codehaus/groovy/eclipse/org.codehaus.groovy.m2eclipse.feature/3.7.0-SNAPSHOT/org.codehaus.groovy.m2eclipse.feature-3.7.0-SNAPSHOT-p2metadata.xml
11-Jan-2020 05:24:46 [INFO] Installing /opt/bamboo-home/xml-data/build-dir/GRECLIPSE-E413-JOB1/extras/Feature-org.codehaus.groovy.m2eclipse/target/p2artifacts.xml to /home/bamboo/.m2/repository/org/codehaus/groovy/eclipse/org.codehaus.groovy.m2eclipse.feature/3.7.0-SNAPSHOT/org.codehaus.groovy.m2eclipse.feature-3.7.0-SNAPSHOT-p2artifacts.xml
11-Jan-2020 05:24:46 [INFO] Installing /opt/bamboo-home/xml-data/build-dir/GRECLIPSE-E413-JOB1/extras/Feature-org.codehaus.groovy.m2eclipse/target/org.codehaus.groovy.m2eclipse.feature-3.7.0-SNAPSHOT-sources-feature.jar to /home/bamboo/.m2/repository/org/codehaus/groovy/eclipse/org.codehaus.groovy.m2eclipse.feature/3.7.0-SNAPSHOT/org.codehaus.groovy.m2eclipse.feature-3.7.0-SNAPSHOT-sources-feature.jar
11-Jan-2020 05:24:46 [INFO] Installing /opt/bamboo-home/xml-data/build-dir/GRECLIPSE-E413-JOB1/extras/Feature-org.codehaus.groovy.m2eclipse/target/p2content.xml to /home/bamboo/.m2/repository/org/codehaus/groovy/eclipse/org.codehaus.groovy.m2eclipse.feature/3.7.0-SNAPSHOT/org.codehaus.groovy.m2eclipse.feature-3.7.0-SNAPSHOT-p2metadata.xml
11-Jan-2020 05:24:46 [INFO] Installing /opt/bamboo-home/xml-data/build-dir/GRECLIPSE-E413-JOB1/extras/Feature-org.codehaus.groovy.m2eclipse/target/p2artifacts.xml to /home/bamboo/.m2/repository/org/codehaus/groovy/eclipse/org.codehaus.groovy.m2eclipse.feature/3.7.0-SNAPSHOT/org.codehaus.groovy.m2eclipse.feature-3.7.0-SNAPSHOT-p2artifacts.xml
11-Jan-2020 05:24:46 [INFO]
11-Jan-2020 05:24:46 [INFO] --- tycho-p2-plugin:1.5.0:update-local-index (default-update-local-index) @ org.codehaus.groovy.m2eclipse.feature ---
11-Jan-2020 05:24:46 [INFO]
11-Jan-2020 05:24:46 [INFO] --- maven-deploy-plugin:2.8.2:deploy (default-deploy) @ org.codehaus.groovy.m2eclipse.feature ---
11-Jan-2020 05:24:46 [INFO] Skipping artifact deployment
11-Jan-2020 05:24:46 [INFO]
11-Jan-2020 05:24:46 [INFO] ----< org.codehaus.groovy.eclipse:org.codehaus.groovy.eclipse.site >----
11-Jan-2020 05:24:46 [INFO] Building org.codehaus.groovy.eclipse.site 3.7.0-SNAPSHOT         [40/40]
11-Jan-2020 05:24:46 [INFO] ------------------------[ eclipse-update-site ]-------------------------
11-Jan-2020 05:24:47 [INFO]
11-Jan-2020 05:24:47 [INFO] --- maven-clean-plugin:2.5:clean (default-clean) @ org.codehaus.groovy.eclipse.site ---
11-Jan-2020 05:24:47 [INFO]
11-Jan-2020 05:24:47 [INFO] --- tycho-packaging-plugin:1.5.0:build-qualifier (default-build-qualifier) @ org.codehaus.groovy.eclipse.site ---
11-Jan-2020 05:24:47 [INFO] The project's OSGi version is 3.7.0.v202001110351-e1909
11-Jan-2020 05:24:47 [INFO]
11-Jan-2020 05:24:47 [INFO] --- properties-maven-plugin:1.0.0:read-project-properties (default) @ org.codehaus.groovy.eclipse.site ---
11-Jan-2020 05:24:47 [INFO]
11-Jan-2020 05:24:47 [INFO] --- tycho-source-plugin:1.5.0:plugin-source (plugin-source) @ org.codehaus.groovy.eclipse.site ---
11-Jan-2020 05:24:47 [INFO]
11-Jan-2020 05:24:47 [INFO] --- tycho-packaging-plugin:1.5.0:update-site (default-update-site) @ org.codehaus.groovy.eclipse.site ---
11-Jan-2020 05:24:47 [INFO]
11-Jan-2020 05:24:47 [INFO] --- tycho-p2-plugin:1.5.0:update-site-p2-metadata (default-update-site-p2-metadata) @ org.codehaus.groovy.eclipse.site ---
11-Jan-2020 05:24:47 [INFO] Command line:
11-Jan-2020 05:24:47         [/opt/jdk8u232-b09/jre/bin/java, -jar, /opt/users/bamboo/.m2/repository/org/eclipse/tycho/tycho-bundles-external/1.5.0/eclipse/plugins/org.eclipse.equinox.launcher_1.5.500.v20190715-1310.jar, -configuration, /tmp/GRECLIPSE-E413-JOB1/tycho-p2-runtime9016871925109593600.tmp/configuration, -nosplash, -application, org.eclipse.equinox.p2.publisher.UpdateSitePublisher, -source, /opt/bamboo-home/xml-data/build-dir/GRECLIPSE-E413-JOB1/Site-org.codehaus.groovy.eclipse/target/site, -metadataRepository, file:/opt/bamboo-home/xml-data/build-dir/GRECLIPSE-E413-JOB1/Site-org.codehaus.groovy.eclipse/target/site/, -metadataRepositoryName, org.codehaus.groovy.eclipse.site, -artifactRepository, file:/opt/bamboo-home/xml-data/build-dir/GRECLIPSE-E413-JOB1/Site-org.codehaus.groovy.eclipse/target/site/, -artifactRepositoryName, org.codehaus.groovy.eclipse.site Artifacts, -noDefaultIUs, -compress]
11-Jan-2020 05:24:48 Generating metadata for ..
11-Jan-2020 05:24:49 Generation completed with success [0 seconds].
11-Jan-2020 05:24:49 [INFO]
11-Jan-2020 05:24:49 [INFO] --- tycho-packaging-plugin:1.5.0:update-site-packaging (default-update-site-packaging) @ org.codehaus.groovy.eclipse.site ---
11-Jan-2020 05:24:49 [INFO] Building zip: /opt/bamboo-home/xml-data/build-dir/GRECLIPSE-E413-JOB1/Site-org.codehaus.groovy.eclipse/target/site.zip
11-Jan-2020 05:24:49 [INFO]
11-Jan-2020 05:24:49 [INFO] --- maven-jarsigner-plugin:3.0.0:sign (sign) @ org.codehaus.groovy.eclipse.site ---
11-Jan-2020 05:24:50 [INFO] 1 archive(s) processed
11-Jan-2020 05:24:50 [INFO]
11-Jan-2020 05:24:50 [INFO] --- tycho-source-feature-plugin:1.5.0:source-feature (source-feature) @ org.codehaus.groovy.eclipse.site ---
11-Jan-2020 05:24:50 [INFO]
11-Jan-2020 05:24:50 [INFO] --- tycho-p2-plugin:1.5.0:p2-metadata (attach-p2-metadata) @ org.codehaus.groovy.eclipse.site ---
11-Jan-2020 05:24:50 [INFO]
11-Jan-2020 05:24:50 [INFO] --- maven-install-plugin:2.3.1:install (default-install) @ org.codehaus.groovy.eclipse.site ---
11-Jan-2020 05:24:50 [INFO] Installing /opt/bamboo-home/xml-data/build-dir/GRECLIPSE-E413-JOB1/Site-org.codehaus.groovy.eclipse/target/site.zip to /home/bamboo/.m2/repository/org/codehaus/groovy/eclipse/org.codehaus.groovy.eclipse.site/3.7.0-SNAPSHOT/org.codehaus.groovy.eclipse.site-3.7.0-SNAPSHOT.zip
11-Jan-2020 05:24:50 [INFO] Installing /opt/bamboo-home/xml-data/build-dir/GRECLIPSE-E413-JOB1/Site-org.codehaus.groovy.eclipse/pom.xml to /home/bamboo/.m2/repository/org/codehaus/groovy/eclipse/org.codehaus.groovy.eclipse.site/3.7.0-SNAPSHOT/org.codehaus.groovy.eclipse.site-3.7.0-SNAPSHOT.pom
11-Jan-2020 05:24:50 [INFO]
11-Jan-2020 05:24:50 [INFO] --- maven-deploy-plugin:2.8.2:deploy (default-deploy) @ org.codehaus.groovy.eclipse.site ---
11-Jan-2020 05:24:50 [INFO] Skipping artifact deployment
11-Jan-2020 05:24:50 [INFO]
11-Jan-2020 05:24:50 [INFO] --- maven-antrun-plugin:1.8:run (upload-dist) @ org.codehaus.groovy.eclipse.site ---
11-Jan-2020 05:24:50 [INFO] Executing tasks
11-Jan-2020 05:24:50
11-Jan-2020 05:24:50 main:
11-Jan-2020 05:24:50      [echo] Uploading main update site to s3..."
11-Jan-2020 05:24:50      [echo] == Are props set so we can deploy? ==
11-Jan-2020 05:24:50      [echo] dist_properties=/home/bamboo/tools/s3.properties
11-Jan-2020 05:24:50      [echo] bamboo_s3_properties=/home/bamboo/tools/s3.properties
11-Jan-2020 05:24:50      [echo] dist.full.version=3.7.0.v202001110351-e1909
11-Jan-2020 05:24:50      [echo] dist.file.name=org.codehaus.groovy-3.7.0.v202001110351-e1909-updatesite.zip
11-Jan-2020 05:24:50       [zip] Building zip: /opt/bamboo-home/xml-data/build-dir/GRECLIPSE-E413-JOB1/Site-org.codehaus.groovy.eclipse/target/org.codehaus.groovy-3.7.0.v202001110351-e1909-updatesite.zip
11-Jan-2020 05:24:53      [echo] Preparing for upload...
11-Jan-2020 05:24:53      [echo] Will Delete:
11-Jan-2020 05:24:53      [echo] dist.bucket=dist.springsource.org
11-Jan-2020 05:24:53      [echo] dist.path=snapshot/GRECLIPSE/e4.13
11-Jan-2020 05:24:53      [echo] Will Upload:
11-Jan-2020 05:24:53      [echo] dist.bucket=dist.springsource.org
11-Jan-2020 05:24:53      [echo] fromDir=/opt/bamboo-home/xml-data/build-dir/GRECLIPSE-E413-JOB1/Site-org.codehaus.groovy.eclipse/target/site
11-Jan-2020 05:24:53      [echo] toDir=snapshot/GRECLIPSE/e4.13
11-Jan-2020 05:24:53      [echo] Will Upload:
11-Jan-2020 05:24:53      [echo] dist.bucket=dist.springsource.org
11-Jan-2020 05:24:53      [echo] fromFile=/opt/bamboo-home/xml-data/build-dir/GRECLIPSE-E413-JOB1/Site-org.codehaus.groovy.eclipse/target/org.codehaus.groovy-3.7.0.v202001110351-e1909-updatesite.zip
11-Jan-2020 05:24:53      [echo] toFile=snapshot/GRECLIPSE/e4.13/org.codehaus.groovy-3.7.0.v202001110351-e1909-updatesite.zip
11-Jan-2020 05:24:53      [echo] metadata bundle.version=3.7.0.v202001110351-e1909
11-Jan-2020 05:24:53      [echo] metadata package.file.name=org.codehaus.groovy-3.7.0.v202001110351-e1909-updatesite.zip
11-Jan-2020 05:24:53      [echo] metadata project.name=Groovy Development Tools
11-Jan-2020 05:24:53      [echo] metadata release.type=snapshot
11-Jan-2020 05:24:55 Deleted s3://dist.springsource.org/snapshot/GRECLIPSE/e4.13/artifacts.jar
11-Jan-2020 05:24:55 Deleted s3://dist.springsource.org/snapshot/GRECLIPSE/e4.13/content.jar
11-Jan-2020 05:24:55 Deleted s3://dist.springsource.org/snapshot/GRECLIPSE/e4.13/features/
11-Jan-2020 05:24:55 Deleted s3://dist.springsource.org/snapshot/GRECLIPSE/e4.13/features/org.codehaus.groovy.compilerless.feature_3.7.0.v202001102201-e1909.jar
11-Jan-2020 05:24:55 Deleted s3://dist.springsource.org/snapshot/GRECLIPSE/e4.13/features/org.codehaus.groovy.eclipse.feature_3.7.0.v202001102201-e1909.jar
11-Jan-2020 05:24:55 Deleted s3://dist.springsource.org/snapshot/GRECLIPSE/e4.13/features/org.codehaus.groovy.headless.feature_3.7.0.v202001102201-e1909.jar
11-Jan-2020 05:24:55 Deleted s3://dist.springsource.org/snapshot/GRECLIPSE/e4.13/features/org.codehaus.groovy.jdt.patch_3.7.0.v202001102201-e1909.jar
11-Jan-2020 05:24:55 Deleted s3://dist.springsource.org/snapshot/GRECLIPSE/e4.13/features/org.codehaus.groovy.m2eclipse.feature_3.7.0.v202001102201-e1909.jar
11-Jan-2020 05:24:56 Deleted s3://dist.springsource.org/snapshot/GRECLIPSE/e4.13/features/org.codehaus.groovy24.feature_3.7.0.v202001102201-e1909.jar
11-Jan-2020 05:24:56 Deleted s3://dist.springsource.org/snapshot/GRECLIPSE/e4.13/features/org.codehaus.groovy25.feature_3.7.0.v202001102201-e1909.jar
11-Jan-2020 05:24:56 Deleted s3://dist.springsource.org/snapshot/GRECLIPSE/e4.13/features/org.codehaus.groovy30.feature_3.7.0.v202001102201-e1909.jar
11-Jan-2020 05:24:56 Deleted s3://dist.springsource.org/snapshot/GRECLIPSE/e4.13/plugins/
11-Jan-2020 05:24:56 Deleted s3://dist.springsource.org/snapshot/GRECLIPSE/e4.13/plugins/org.codehaus.groovy.eclipse.ant_3.7.0.v202001102201-e1909.jar
11-Jan-2020 05:24:56 Deleted s3://dist.springsource.org/snapshot/GRECLIPSE/e4.13/plugins/org.codehaus.groovy.eclipse.astviews_3.7.0.v202001102201-e1909.jar
11-Jan-2020 05:24:56 Deleted s3://dist.springsource.org/snapshot/GRECLIPSE/e4.13/plugins/org.codehaus.groovy.eclipse.codeassist_3.7.0.v202001102201-e1909.jar
11-Jan-2020 05:24:56 Deleted s3://dist.springsource.org/snapshot/GRECLIPSE/e4.13/plugins/org.codehaus.groovy.eclipse.codebrowsing_3.7.0.v202001102201-e1909.jar
11-Jan-2020 05:24:56 Deleted s3://dist.springsource.org/snapshot/GRECLIPSE/e4.13/plugins/org.codehaus.groovy.eclipse.compilerResolver_3.7.0.v202001102201-e1909.jar
11-Jan-2020 05:24:56 Deleted s3://dist.springsource.org/snapshot/GRECLIPSE/e4.13/plugins/org.codehaus.groovy.eclipse.core_3.7.0.v202001102201-e1909.jar
11-Jan-2020 05:24:56 Deleted s3://dist.springsource.org/snapshot/GRECLIPSE/e4.13/plugins/org.codehaus.groovy.eclipse.dsl_3.7.0.v202001102201-e1909.jar
11-Jan-2020 05:24:57 Deleted s3://dist.springsource.org/snapshot/GRECLIPSE/e4.13/plugins/org.codehaus.groovy.eclipse.quickfix_3.7.0.v202001102201-e1909.jar
11-Jan-2020 05:24:57 Deleted s3://dist.springsource.org/snapshot/GRECLIPSE/e4.13/plugins/org.codehaus.groovy.eclipse.refactoring_3.7.0.v202001102201-e1909.jar
11-Jan-2020 05:24:57 Deleted s3://dist.springsource.org/snapshot/GRECLIPSE/e4.13/plugins/org.codehaus.groovy.eclipse.ui_3.7.0.v202001102201-e1909.jar
11-Jan-2020 05:24:57 Deleted s3://dist.springsource.org/snapshot/GRECLIPSE/e4.13/plugins/org.codehaus.groovy.eclipse_3.7.0.v202001102201-e1909.jar
11-Jan-2020 05:24:57 Deleted s3://dist.springsource.org/snapshot/GRECLIPSE/e4.13/plugins/org.codehaus.groovy.m2eclipse_3.7.0.v202001102201-e1909.jar
11-Jan-2020 05:24:57 Deleted s3://dist.springsource.org/snapshot/GRECLIPSE/e4.13/plugins/org.codehaus.groovy_2.4.17.v202001102201-e1909.jar
11-Jan-2020 05:24:57 Deleted s3://dist.springsource.org/snapshot/GRECLIPSE/e4.13/plugins/org.codehaus.groovy_2.5.8.v202001102201-e1909.jar
11-Jan-2020 05:24:57 Deleted s3://dist.springsource.org/snapshot/GRECLIPSE/e4.13/plugins/org.codehaus.groovy_3.0.0.v202001102201-e1909.jar
11-Jan-2020 05:24:57 Deleted s3://dist.springsource.org/snapshot/GRECLIPSE/e4.13/plugins/org.eclipse.jdt.core_3.19.0.v202001102201-e1909.jar
11-Jan-2020 05:24:57 Deleted s3://dist.springsource.org/snapshot/GRECLIPSE/e4.13/plugins/org.eclipse.jdt.groovy.core_3.7.0.v202001102201-e1909.jar
11-Jan-2020 05:24:58 Deleted s3://dist.springsource.org/snapshot/GRECLIPSE/e4.13/site.xml
11-Jan-2020 05:24:58 Uploading /opt/bamboo-home/xml-data/build-dir/GRECLIPSE-E413-JOB1/Site-org.codehaus.groovy.eclipse/target/site/artifacts.jar (2.8 KB) to s3://dist.springsource.org/snapshot/GRECLIPSE/e4.13/artifacts.jar
11-Jan-2020 05:24:58 Transfer Time: .2 s - Transfer Rate: 16.7 KB/s
11-Jan-2020 05:24:58 Uploading /opt/bamboo-home/xml-data/build-dir/GRECLIPSE-E413-JOB1/Site-org.codehaus.groovy.eclipse/target/site/content.jar (11.2 KB) to s3://dist.springsource.org/snapshot/GRECLIPSE/e4.13/content.jar
11-Jan-2020 05:24:58 Transfer Time: .2 s - Transfer Rate: 66.1 KB/s
11-Jan-2020 05:24:59 Uploading /opt/bamboo-home/xml-data/build-dir/GRECLIPSE-E413-JOB1/Site-org.codehaus.groovy.eclipse/target/site/features/org.codehaus.groovy.compilerless.feature_3.7.0.v202001110351-e1909.jar (15.0 KB) to s3://dist.springsource.org/snapshot/GRECLIPSE/e4.13/features/org.codehaus.groovy.compilerless.feature_3.7.0.v202001110351-e1909.jar
11-Jan-2020 05:24:59 Transfer Time: .2 s - Transfer Rate: 87.0 KB/s
11-Jan-2020 05:24:59 Uploading /opt/bamboo-home/xml-data/build-dir/GRECLIPSE-E413-JOB1/Site-org.codehaus.groovy.eclipse/target/site/features/org.codehaus.groovy.eclipse.feature_3.7.0.v202001110351-e1909.jar (14.9 KB) to s3://dist.springsource.org/snapshot/GRECLIPSE/e4.13/features/org.codehaus.groovy.eclipse.feature_3.7.0.v202001110351-e1909.jar
11-Jan-2020 05:25:00 Transfer Time: .2 s - Transfer Rate: 61.8 KB/s
11-Jan-2020 05:25:01 Uploading /opt/bamboo-home/xml-data/build-dir/GRECLIPSE-E413-JOB1/Site-org.codehaus.groovy.eclipse/target/site/features/org.codehaus.groovy.headless.feature_3.7.0.v202001110351-e1909.jar (14.9 KB) to s3://dist.springsource.org/snapshot/GRECLIPSE/e4.13/features/org.codehaus.groovy.headless.feature_3.7.0.v202001110351-e1909.jar
11-Jan-2020 05:25:01 Transfer Time: .3 s - Transfer Rate: 56.3 KB/s
11-Jan-2020 05:25:01 Uploading /opt/bamboo-home/xml-data/build-dir/GRECLIPSE-E413-JOB1/Site-org.codehaus.groovy.eclipse/target/site/features/org.codehaus.groovy.jdt.patch_3.7.0.v202001110351-e1909.jar (9.3 KB) to s3://dist.springsource.org/snapshot/GRECLIPSE/e4.13/features/org.codehaus.groovy.jdt.patch_3.7.0.v202001110351-e1909.jar
11-Jan-2020 05:25:02 Transfer Time: .5 s - Transfer Rate: 20.3 KB/s
11-Jan-2020 05:25:02 Uploading /opt/bamboo-home/xml-data/build-dir/GRECLIPSE-E413-JOB1/Site-org.codehaus.groovy.eclipse/target/site/features/org.codehaus.groovy.m2eclipse.feature_3.7.0.v202001110351-e1909.jar (14.9 KB) to s3://dist.springsource.org/snapshot/GRECLIPSE/e4.13/features/org.codehaus.groovy.m2eclipse.feature_3.7.0.v202001110351-e1909.jar
11-Jan-2020 05:25:02 Transfer Time: .2 s - Transfer Rate: 79.3 KB/s
11-Jan-2020 05:25:03 Uploading /opt/bamboo-home/xml-data/build-dir/GRECLIPSE-E413-JOB1/Site-org.codehaus.groovy.eclipse/target/site/features/org.codehaus.groovy24.feature_3.7.0.v202001110351-e1909.jar (14.8 KB) to s3://dist.springsource.org/snapshot/GRECLIPSE/e4.13/features/org.codehaus.groovy24.feature_3.7.0.v202001110351-e1909.jar
11-Jan-2020 05:25:03 Transfer Time: .2 s - Transfer Rate: 87.8 KB/s
11-Jan-2020 05:25:03 Uploading /opt/bamboo-home/xml-data/build-dir/GRECLIPSE-E413-JOB1/Site-org.codehaus.groovy.eclipse/target/site/features/org.codehaus.groovy25.feature_3.7.0.v202001110351-e1909.jar (14.8 KB) to s3://dist.springsource.org/snapshot/GRECLIPSE/e4.13/features/org.codehaus.groovy25.feature_3.7.0.v202001110351-e1909.jar
11-Jan-2020 05:25:03 Transfer Time: .2 s - Transfer Rate: 88.3 KB/s
11-Jan-2020 05:25:04 Uploading /opt/bamboo-home/xml-data/build-dir/GRECLIPSE-E413-JOB1/Site-org.codehaus.groovy.eclipse/target/site/features/org.codehaus.groovy30.feature_3.7.0.v202001110351-e1909.jar (14.8 KB) to s3://dist.springsource.org/snapshot/GRECLIPSE/e4.13/features/org.codehaus.groovy30.feature_3.7.0.v202001110351-e1909.jar
11-Jan-2020 05:25:04 Transfer Time: .2 s - Transfer Rate: 89.4 KB/s
11-Jan-2020 05:25:04 Uploading /opt/bamboo-home/xml-data/build-dir/GRECLIPSE-E413-JOB1/Site-org.codehaus.groovy.eclipse/target/site/plugins/org.codehaus.groovy.eclipse.ant_3.7.0.v202001110351-e1909.jar (11.5 KB) to s3://dist.springsource.org/snapshot/GRECLIPSE/e4.13/plugins/org.codehaus.groovy.eclipse.ant_3.7.0.v202001110351-e1909.jar
11-Jan-2020 05:25:05 Transfer Time: .2 s - Transfer Rate: 62.0 KB/s
11-Jan-2020 05:25:05 Uploading /opt/bamboo-home/xml-data/build-dir/GRECLIPSE-E413-JOB1/Site-org.codehaus.groovy.eclipse/target/site/plugins/org.codehaus.groovy.eclipse.astviews_3.7.0.v202001110351-e1909.jar (79.2 KB) to s3://dist.springsource.org/snapshot/GRECLIPSE/e4.13/plugins/org.codehaus.groovy.eclipse.astviews_3.7.0.v202001110351-e1909.jar
11-Jan-2020 05:25:05 Transfer Time: .3 s - Transfer Rate: 285.9 KB/s
11-Jan-2020 05:25:06 Uploading /opt/bamboo-home/xml-data/build-dir/GRECLIPSE-E413-JOB1/Site-org.codehaus.groovy.eclipse/target/site/plugins/org.codehaus.groovy.eclipse.codeassist_3.7.0.v202001110351-e1909.jar (274.0 KB) to s3://dist.springsource.org/snapshot/GRECLIPSE/e4.13/plugins/org.codehaus.groovy.eclipse.codeassist_3.7.0.v202001110351-e1909.jar
11-Jan-2020 05:25:06 Transfer Time: .4 s - Transfer Rate: 771.7 KB/s
11-Jan-2020 05:25:06 Uploading /opt/bamboo-home/xml-data/build-dir/GRECLIPSE-E413-JOB1/Site-org.codehaus.groovy.eclipse/target/site/plugins/org.codehaus.groovy.eclipse.codebrowsing_3.7.0.v202001110351-e1909.jar (86.8 KB) to s3://dist.springsource.org/snapshot/GRECLIPSE/e4.13/plugins/org.codehaus.groovy.eclipse.codebrowsing_3.7.0.v202001110351-e1909.jar
11-Jan-2020 05:25:07 Transfer Time: .2 s - Transfer Rate: 504.8 KB/s
11-Jan-2020 05:25:07 Uploading /opt/bamboo-home/xml-data/build-dir/GRECLIPSE-E413-JOB1/Site-org.codehaus.groovy.eclipse/target/site/plugins/org.codehaus.groovy.eclipse.compilerResolver_3.7.0.v202001110351-e1909.jar (20.4 KB) to s3://dist.springsource.org/snapshot/GRECLIPSE/e4.13/plugins/org.codehaus.groovy.eclipse.compilerResolver_3.7.0.v202001110351-e1909.jar
11-Jan-2020 05:25:07 Transfer Time: .2 s - Transfer Rate: 86.2 KB/s
11-Jan-2020 05:25:08 Uploading /opt/bamboo-home/xml-data/build-dir/GRECLIPSE-E413-JOB1/Site-org.codehaus.groovy.eclipse/target/site/plugins/org.codehaus.groovy.eclipse.core_3.7.0.v202001110351-e1909.jar (84.0 KB) to s3://dist.springsource.org/snapshot/GRECLIPSE/e4.13/plugins/org.codehaus.groovy.eclipse.core_3.7.0.v202001110351-e1909.jar
11-Jan-2020 05:25:08 Transfer Time: .2 s - Transfer Rate: 359.1 KB/s
11-Jan-2020 05:25:08 Uploading /opt/bamboo-home/xml-data/build-dir/GRECLIPSE-E413-JOB1/Site-org.codehaus.groovy.eclipse/target/site/plugins/org.codehaus.groovy.eclipse.dsl_3.7.0.v202001110351-e1909.jar (395.7 KB) to s3://dist.springsource.org/snapshot/GRECLIPSE/e4.13/plugins/org.codehaus.groovy.eclipse.dsl_3.7.0.v202001110351-e1909.jar
11-Jan-2020 05:25:09 Transfer Time: .3 s - Transfer Rate: 1.2 MB/s
11-Jan-2020 05:25:09 Uploading /opt/bamboo-home/xml-data/build-dir/GRECLIPSE-E413-JOB1/Site-org.codehaus.groovy.eclipse/target/site/plugins/org.codehaus.groovy.eclipse.quickfix_3.7.0.v202001110351-e1909.jar (108.9 KB) to s3://dist.springsource.org/snapshot/GRECLIPSE/e4.13/plugins/org.codehaus.groovy.eclipse.quickfix_3.7.0.v202001110351-e1909.jar
11-Jan-2020 05:25:09 Transfer Time: .2 s - Transfer Rate: 633.4 KB/s
11-Jan-2020 05:25:10 Uploading /opt/bamboo-home/xml-data/build-dir/GRECLIPSE-E413-JOB1/Site-org.codehaus.groovy.eclipse/target/site/plugins/org.codehaus.groovy.eclipse.refactoring_3.7.0.v202001110351-e1909.jar (272.1 KB) to s3://dist.springsource.org/snapshot/GRECLIPSE/e4.13/plugins/org.codehaus.groovy.eclipse.refactoring_3.7.0.v202001110351-e1909.jar
11-Jan-2020 05:25:10 Transfer Time: .2 s - Transfer Rate: 1.5 MB/s
11-Jan-2020 05:25:11 Uploading /opt/bamboo-home/xml-data/build-dir/GRECLIPSE-E413-JOB1/Site-org.codehaus.groovy.eclipse/target/site/plugins/org.codehaus.groovy.eclipse.ui_3.7.0.v202001110351-e1909.jar (549.8 KB) to s3://dist.springsource.org/snapshot/GRECLIPSE/e4.13/plugins/org.codehaus.groovy.eclipse.ui_3.7.0.v202001110351-e1909.jar
11-Jan-2020 05:25:11 Transfer Time: .3 s - Transfer Rate: 2.0 MB/s
11-Jan-2020 05:25:11 Uploading /opt/bamboo-home/xml-data/build-dir/GRECLIPSE-E413-JOB1/Site-org.codehaus.groovy.eclipse/target/site/plugins/org.codehaus.groovy.eclipse_3.7.0.v202001110351-e1909.jar (16.7 KB) to s3://dist.springsource.org/snapshot/GRECLIPSE/e4.13/plugins/org.codehaus.groovy.eclipse_3.7.0.v202001110351-e1909.jar
11-Jan-2020 05:25:11 Transfer Time: .2 s - Transfer Rate: 67.9 KB/s
11-Jan-2020 05:25:12 Uploading /opt/bamboo-home/xml-data/build-dir/GRECLIPSE-E413-JOB1/Site-org.codehaus.groovy.eclipse/target/site/plugins/org.codehaus.groovy.m2eclipse_3.7.0.v202001110351-e1909.jar (18.6 KB) to s3://dist.springsource.org/snapshot/GRECLIPSE/e4.13/plugins/org.codehaus.groovy.m2eclipse_3.7.0.v202001110351-e1909.jar
11-Jan-2020 05:25:12 Transfer Time: .2 s - Transfer Rate: 95.8 KB/s
11-Jan-2020 05:25:12 Uploading /opt/bamboo-home/xml-data/build-dir/GRECLIPSE-E413-JOB1/Site-org.codehaus.groovy.eclipse/target/site/plugins/org.codehaus.groovy_2.4.17.v202001110351-e1909.jar (18.8 MB) to s3://dist.springsource.org/snapshot/GRECLIPSE/e4.13/plugins/org.codehaus.groovy_2.4.17.v202001110351-e1909.jar
11-Jan-2020 05:25:13 Transfer Time: .7 s - Transfer Rate: 26.6 MB/s
11-Jan-2020 05:25:14 Uploading /opt/bamboo-home/xml-data/build-dir/GRECLIPSE-E413-JOB1/Site-org.codehaus.groovy.eclipse/target/site/plugins/org.codehaus.groovy_2.5.8.v202001110351-e1909.jar (17.7 MB) to s3://dist.springsource.org/snapshot/GRECLIPSE/e4.13/plugins/org.codehaus.groovy_2.5.8.v202001110351-e1909.jar
11-Jan-2020 05:25:14 Transfer Time: .6 s - Transfer Rate: 28.5 MB/s
11-Jan-2020 05:25:15 Uploading /opt/bamboo-home/xml-data/build-dir/GRECLIPSE-E413-JOB1/Site-org.codehaus.groovy.eclipse/target/site/plugins/org.codehaus.groovy_3.0.0.v202001110351-e1909.jar (22.0 MB) to s3://dist.springsource.org/snapshot/GRECLIPSE/e4.13/plugins/org.codehaus.groovy_3.0.0.v202001110351-e1909.jar
11-Jan-2020 05:25:15 Transfer Time: .7 s - Transfer Rate: 30.7 MB/s
11-Jan-2020 05:25:16 Uploading /opt/bamboo-home/xml-data/build-dir/GRECLIPSE-E413-JOB1/Site-org.codehaus.groovy.eclipse/target/site/plugins/org.eclipse.jdt.core_3.19.0.v202001110351-e1909.jar (6.7 MB) to s3://dist.springsource.org/snapshot/GRECLIPSE/e4.13/plugins/org.eclipse.jdt.core_3.19.0.v202001110351-e1909.jar
11-Jan-2020 05:25:16 Transfer Time: .4 s - Transfer Rate: 15.5 MB/s
11-Jan-2020 05:25:17 Uploading /opt/bamboo-home/xml-data/build-dir/GRECLIPSE-E413-JOB1/Site-org.codehaus.groovy.eclipse/target/site/plugins/org.eclipse.jdt.groovy.core_3.7.0.v202001110351-e1909.jar (461.3 KB) to s3://dist.springsource.org/snapshot/GRECLIPSE/e4.13/plugins/org.eclipse.jdt.groovy.core_3.7.0.v202001110351-e1909.jar
11-Jan-2020 05:25:17 Transfer Time: .2 s - Transfer Rate: 2.0 MB/s
11-Jan-2020 05:25:17 Uploading /opt/bamboo-home/xml-data/build-dir/GRECLIPSE-E413-JOB1/Site-org.codehaus.groovy.eclipse/target/site/site.xml (2.8 KB) to s3://dist.springsource.org/snapshot/GRECLIPSE/e4.13/site.xml
11-Jan-2020 05:25:17 Transfer Time: .2 s - Transfer Rate: 11.7 KB/s
11-Jan-2020 05:25:18 Uploading /opt/bamboo-home/xml-data/build-dir/GRECLIPSE-E413-JOB1/Site-org.codehaus.groovy.eclipse/target/org.codehaus.groovy-3.7.0.v202001110351-e1909-updatesite.zip (67.2 MB) to s3://dist.springsource.org/snapshot/GRECLIPSE/e4.13/org.codehaus.groovy-3.7.0.v202001110351-e1909-updatesite.zip
11-Jan-2020 05:25:20 Transfer Time: 2.1 s - Transfer Rate: 31.3 MB/s
11-Jan-2020 05:25:20 Uploading /opt/bamboo-home/xml-data/build-dir/GRECLIPSE-E413-JOB1/Site-org.codehaus.groovy.eclipse/target/org.codehaus.groovy-3.7.0.v202001110351-e1909-updatesite.zip.md5 (.0 KB) to s3://dist.springsource.org/snapshot/GRECLIPSE/e4.13/org.codehaus.groovy-3.7.0.v202001110351-e1909-updatesite.zip.md5
11-Jan-2020 05:25:20 Transfer Time: .2 s - Transfer Rate: .2 KB/s
11-Jan-2020 05:25:21 Uploading /opt/bamboo-home/xml-data/build-dir/GRECLIPSE-E413-JOB1/Site-org.codehaus.groovy.eclipse/target/org.codehaus.groovy-3.7.0.v202001110351-e1909-updatesite.zip.sha1 (.0 KB) to s3://dist.springsource.org/snapshot/GRECLIPSE/e4.13/org.codehaus.groovy-3.7.0.v202001110351-e1909-updatesite.zip.sha1
11-Jan-2020 05:25:21 Transfer Time: .2 s - Transfer Rate: .3 KB/s
11-Jan-2020 05:25:21 [INFO] Executed tasks
11-Jan-2020 05:25:21 [INFO] ------------------------------------------------------------------------
11-Jan-2020 05:25:21 [INFO] Reactor Summary:
11-Jan-2020 05:25:21 [INFO]
11-Jan-2020 05:25:21 [INFO] org.codehaus.groovy.eclipse.parent 3.7.0-SNAPSHOT .. SUCCESS [  0.152 s]
11-Jan-2020 05:25:21 [INFO] org.codehaus.groovy 2.4.17-SNAPSHOT ................ SUCCESS [  6.180 s]
11-Jan-2020 05:25:21 [INFO] org.codehaus.groovy 2.5.8-SNAPSHOT ................. SUCCESS [  3.769 s]
11-Jan-2020 05:25:21 [INFO] org.codehaus.groovy 3.0.0-SNAPSHOT ................. SUCCESS [  4.878 s]
11-Jan-2020 05:25:21 [INFO] org.codehaus.groovy.eclipse.compilerResolver ....... SUCCESS [  0.912 s]
11-Jan-2020 05:25:21 [INFO] org.eclipse.jdt.core 3.19.0-SNAPSHOT ............... SUCCESS [ 10.495 s]
11-Jan-2020 05:25:21 [INFO] org.eclipse.jdt.groovy.core ........................ SUCCESS [  1.873 s]
11-Jan-2020 05:25:21 [INFO] org.codehaus.groovy.eclipse ........................ SUCCESS [  0.354 s]
11-Jan-2020 05:25:21 [INFO] org.codehaus.groovy.eclipse.core ................... SUCCESS [  1.069 s]
11-Jan-2020 05:25:21 [INFO] org.codehaus.groovy.eclipse.ant .................... SUCCESS [  0.950 s]
11-Jan-2020 05:25:21 [INFO] org.codehaus.groovy.eclipse.codebrowsing ........... SUCCESS [  1.093 s]
11-Jan-2020 05:25:21 [INFO] org.codehaus.groovy.eclipse.refactoring ............ SUCCESS [  1.470 s]
11-Jan-2020 05:25:21 [INFO] org.codehaus.groovy.eclipse.ui ..................... SUCCESS [  1.907 s]
11-Jan-2020 05:25:21 [INFO] org.codehaus.groovy.eclipse.astviews ............... SUCCESS [  2.624 s]
11-Jan-2020 05:25:21 [INFO] org.codehaus.groovy.eclipse.codeassist ............. SUCCESS [  1.286 s]
11-Jan-2020 05:25:21 [INFO] org.codehaus.groovy.eclipse.dsl .................... SUCCESS [  1.670 s]
11-Jan-2020 05:25:21 [INFO] org.codehaus.groovy.eclipse.quickfix ............... SUCCESS [  1.119 s]
11-Jan-2020 05:25:21 [INFO] org.codehaus.groovy24.feature ...................... SUCCESS [  0.488 s]
11-Jan-2020 05:25:21 [INFO] org.codehaus.groovy25.feature ...................... SUCCESS [  0.448 s]
11-Jan-2020 05:25:21 [INFO] org.codehaus.groovy30.feature ...................... SUCCESS [  0.437 s]
11-Jan-2020 05:25:21 [INFO] org.codehaus.groovy.jdt.patch ...................... SUCCESS [  0.391 s]
11-Jan-2020 05:25:21 [INFO] org.codehaus.groovy.headless.feature ............... SUCCESS [  0.544 s]
11-Jan-2020 05:25:21 [INFO] org.codehaus.groovy.compilerless.feature ........... SUCCESS [  0.755 s]
11-Jan-2020 05:25:21 [INFO] org.codehaus.groovy.eclipse.feature ................ SUCCESS [  0.426 s]
11-Jan-2020 05:25:21 [INFO] org.eclipse.jdt.core.tests.compiler 3.12.950-SNAPSHOT SUCCESS [  4.391 s]
11-Jan-2020 05:25:21 [INFO] org.eclipse.jdt.core.tests.builder 3.10.700-SNAPSHOT SUCCESS [  1.156 s]
11-Jan-2020 05:25:21 [INFO] org.eclipse.jdt.groovy.core.tests.compiler ......... SUCCESS [  1.086 s]
11-Jan-2020 05:25:21 [INFO] org.eclipse.jdt.groovy.core.tests.builder .......... SUCCESS [  1.185 s]
11-Jan-2020 05:25:21 [INFO] org.codehaus.groovy.eclipse.tests .................. SUCCESS [  2.873 s]
11-Jan-2020 05:25:21 [INFO] org.codehaus.groovy.eclipse.codeassist.test ........ SUCCESS [  2.184 s]
11-Jan-2020 05:25:21 [INFO] org.codehaus.groovy.eclipse.codebrowsing.test ...... SUCCESS [  1.514 s]
11-Jan-2020 05:25:21 [INFO] org.codehaus.groovy.eclipse.core.test .............. SUCCESS [  1.261 s]
11-Jan-2020 05:25:21 [INFO] org.codehaus.groovy.eclipse.dsl.tests .............. SUCCESS [  1.612 s]
11-Jan-2020 05:25:21 [INFO] org.codehaus.groovy.eclipse.junit.test ............. SUCCESS [  1.168 s]
11-Jan-2020 05:25:21 [INFO] org.codehaus.groovy.eclipse.refactoring.test ....... SUCCESS [  2.282 s]
11-Jan-2020 05:25:21 [INFO] org.codehaus.groovy.eclipse.quickfix.test .......... SUCCESS [  1.313 s]
11-Jan-2020 05:25:21 [INFO] org.codehaus.groovy.alltests ....................... SUCCESS [  01:32 h]
11-Jan-2020 05:25:21 [INFO] org.codehaus.groovy.m2eclipse ...................... SUCCESS [  1.077 s]
11-Jan-2020 05:25:21 [INFO] org.codehaus.groovy.m2eclipse.feature .............. SUCCESS [  0.537 s]
11-Jan-2020 05:25:21 [INFO] org.codehaus.groovy.eclipse.site 3.7.0-SNAPSHOT .... SUCCESS [ 34.333 s]
11-Jan-2020 05:25:21 [INFO] ------------------------------------------------------------------------
11-Jan-2020 05:25:21 [INFO] BUILD SUCCESS
11-Jan-2020 05:25:21 [INFO] ------------------------------------------------------------------------
11-Jan-2020 05:25:21 [INFO] Total time: 01:34 h
11-Jan-2020 05:25:21 [INFO] Finished at: 2020-01-11T05:25:21Z
11-Jan-2020 05:25:21 [INFO] ------------------------------------------------------------------------
11-Jan-2020 05:25:21 [WARNING] The requested profile "snapshot" could not be activated because it does not exist.
11-Jan-2020 05:25:22 Parsing test results under /opt/bamboo-home/xml-data/build-dir/GRECLIPSE-E413-JOB1...
11-Jan-2020 05:25:22 Failing task since 3 failing test cases were found.
11-Jan-2020 05:25:22 Finished task 'Maven 3.x' with result: Failed
11-Jan-2020 05:25:22 Running post build plugin 'Docker Container Cleanup'
11-Jan-2020 05:25:22 Running post build plugin 'NCover Results Collector'
11-Jan-2020 05:25:22 Running post build plugin 'Artifactory Release Management Staging'
11-Jan-2020 05:25:22 Running post build plugin 'Artifactory Build Info Copier'
11-Jan-2020 05:25:22 Running post build plugin 'Artifactory Gradle Properties Info Copier'
11-Jan-2020 05:25:22 Running post build plugin 'Clover Results Collector'
11-Jan-2020 05:25:22 Running post build plugin 'npm Cache Cleanup'
11-Jan-2020 05:25:22 Running post build plugin 'Artifact Copier'
11-Jan-2020 05:25:22 Publishing an artifact: Zipped Update Site
11-Jan-2020 05:25:22 Finished publishing of artifact Non required job artifact: [Zipped Update Site], pattern: [**/*updatesite.zip] anchored at: [Site-org.codehaus.groovy.eclipse/target/site] in 10.84 ms
11-Jan-2020 05:25:22 Publishing an artifact: surefire-reports
11-Jan-2020 05:25:23 Finished publishing of artifact Non required job artifact: [surefire-reports], pattern: [**/target/TEST-*.xml] in 755.4 ms
11-Jan-2020 05:25:24 Successfully removed working directory at '/opt/bamboo-home/xml-data/build-dir/GRECLIPSE-E413-JOB1'
11-Jan-2020 05:25:24 Finalising the build...
11-Jan-2020 05:25:24 Stopping timer.
11-Jan-2020 05:25:24 Build GRECLIPSE-E413-JOB1-176 completed.
11-Jan-2020 05:25:24 Running on server: post build plugin 'NCover Results Collector'
11-Jan-2020 05:25:24 Running on server: post build plugin 'Build Hanging Detection Configuration'
11-Jan-2020 05:25:24 Running on server: post build plugin 'Bamboo project link creator'
11-Jan-2020 05:25:24 Running on server: post build plugin 'Clover Delta Calculator'
11-Jan-2020 05:25:24 Running on server: post build plugin 'Maven Dependencies Postprocessor'
11-Jan-2020 05:25:24 All post build plugins have finished
11-Jan-2020 05:25:24 Generating build results summary...
11-Jan-2020 05:25:25 Saving build results to disk...
11-Jan-2020 05:25:25 Logging substituted variables...
11-Jan-2020 05:25:25 Indexing build results...
11-Jan-2020 05:25:25 Finished building GRECLIPSE-E413-JOB1-176.