Build: #176 failed

Job: Default Job failed

Stages & jobs

  1. Default Stage

Test results

  • 6,279 tests in total
  • 3 tests failed
  • 3 failures are new
  • 37 tests were fixed
  • 140 tests were quarantined / skipped
  • 89 minutes taken in total.

Build 176 has the following 3 errors: 3 new failure(s) occurred since the previous build.

New test failures 3
Status Test Duration
Collapse Failed BuildAccessRulesTests testAccessForLazyProperty History
< 1 sec
junit.framework.ComparisonFailure: 
----------- Expected ------------
Problem : Access restriction: The type 'BeanInfo' is not API (restriction on required library '##') [ resource : </Project/src/Foo.groovy> range : <49,57> category : <150> severity : <2>]

------------ but was ------------

--------- Difference is ----------
 expected:<[Problem : Access restriction: The type 'BeanInfo' is not API (restriction on required library '##') [ resource : </Project/src/Foo.groovy> range : <49,57> category : <150> severity : <2>]
(13 more lines...)
Collapse Failed ConstructorReferenceSearchTests testConstructorReferences2 History
< 1 sec
java.lang.AssertionError: Incorrect number of matches; expected:<1> but was:<0>
	at org.eclipse.jdt.core.groovy.tests.search.ConstructorReferenceSearchTests.testConstructorReferences2(ConstructorReferenceSearchTests.java:96)
Collapse Failed InferencingTests testLocalTypeAndDefaultImportCollision History
< 1 sec
java.lang.AssertionError: Expected type not found.
Expected: domain.Calendar
Found: java.lang.String
Declaring type: Search
ASTNode: org.codehaus.groovy.ast.expr.VariableExpression@e9ecc[variable: cal]
Confidence: INFERRED

java.lang.AssertionError: 
(8 more lines...)