Build: #177 failed

Job: Default Job failed

Stages & jobs

  1. Default Stage

Test results

  • 6,281 tests in total
  • 5 tests failed
  • 5 failures are new
  • 3 tests were fixed
  • 140 tests were quarantined / skipped
  • 89 minutes taken in total.

Build 177 has the following 5 errors: 5 new failure(s) occurred since the previous build.

New test failures 5
Status Test Duration
Collapse Failed BinarySearchTests testClassDecl1 History
1 sec
java.lang.AssertionError: Expecting 12 matches, but found 0

java.lang.AssertionError: 
Expecting 12 matches, but found 0

	at org.eclipse.jdt.core.groovy.tests.search.BinarySearchTests.assertMatches(BinarySearchTests.java:139)
	at org.eclipse.jdt.core.groovy.tests.search.BinarySearchTests.testClassDecl1(BinarySearchTests.java:165)
Collapse Failed ClosureInferencingTests testNestedClosure11 History
< 1 sec
java.lang.AssertionError: Expected type not found.
Expected: java.lang.Integer
Found: Search
Declaring type: groovy.lang.Closure<V extends java.lang.Object>
ASTNode: org.codehaus.groovy.ast.expr.ConstantExpression@f9e59[delegate]
Confidence: INFERRED

java.lang.AssertionError: 
(8 more lines...)
Collapse Failed ConstructorReferenceSearchTests testConstructorReferences12 History
< 1 sec
java.lang.AssertionError: expected:<2> but was:<0>
	at org.eclipse.jdt.core.groovy.tests.search.ConstructorReferenceSearchTests.testConstructorReferences12(ConstructorReferenceSearchTests.java:313)
Collapse Failed ConstructorReferenceSearchTests testConstructorReferences12a History
< 1 sec
java.lang.AssertionError: expected:<3> but was:<0>
	at org.eclipse.jdt.core.groovy.tests.search.ConstructorReferenceSearchTests.testConstructorReferences12a(ConstructorReferenceSearchTests.java:332)
Collapse Failed DGMInferencingTests testDGM20 History
< 1 sec
java.lang.AssertionError: Expected type not found.
Expected: java.lang.String
Found: java.lang.Object
Declaring type: Search
ASTNode: org.codehaus.groovy.ast.expr.VariableExpression@f0804[variable: key]
Confidence: INFERRED

java.lang.AssertionError: 
(9 more lines...)