Build: #182 failed

Job: Default Job failed

Stages & jobs

  1. Default Stage

Job result summary

Completed
Duration
94 minutes
Agent
bamboo-18.af.pivotal.io
Revision
62e711d1a5f484cdb2bed65686cb63de069c0749 62e711d1a5f484cdb2bed65686cb63de069c0749
Total tests
6284
Failing since
#169 (Code changes detected – )
Fixed in
#186 (Code changes detected)

Tests

  • 6,284 tests in total
  • 11 tests failed
  • 11 failures are new
  • 4 tests were fixed
  • 140 tests were quarantined / skipped
  • 90 minutes taken in total.
New test failures 11
Status Test Duration
Collapse Failed RenamePackageTests testRenamePackage2 History
1 sec
org.junit.ComparisonFailure: Refactoring produced unexpected results: expected:<...class C { def foo = [q].B.CONST }> but was:<...class C { def foo = [p].B.CONST }>
	at org.codehaus.groovy.eclipse.refactoring.test.rename.RenamePackageTests.renamePackage(RenamePackageTests.groovy:54)
	at org.codehaus.groovy.eclipse.refactoring.test.rename.RenamePackageTests.testRenamePackage2(RenamePackageTests.groovy:96)
Collapse Failed RenamePackageTests testRenamePackage3 History
1 sec
org.junit.ComparisonFailure: Refactoring produced unexpected results: expected:<...ckage q
class E {
  [q.D foo
  private q.D bar
  q.D baz() { new q].D() }
}
> but was:<...ckage q
class E {
(21 more lines...)
Collapse Failed RenamePackageTests testRenamePackage4 History
1 sec
org.junit.ComparisonFailure: Refactoring produced unexpected results: expected:<package x
import [q].F
class C {
  def f...> but was:<package x
import [p].F
class C {
  def f...>
org.junit.ComparisonFailure: 
(9 more lines...)
Collapse Failed RenamePackageTests testRenamePackage5 History
1 sec
org.junit.ComparisonFailure: Refactoring produced unexpected results: expected:<...age x
import static [q].H.*
class C {
  def...> but was:<...age x
import static [p].H.*
class C {
  def...>
org.junit.ComparisonFailure: 
(9 more lines...)
Collapse Failed BinarySearchTests testClassDecl1 History
1 sec
java.lang.AssertionError: Expecting 12 matches, but found 0

java.lang.AssertionError: 
Expecting 12 matches, but found 0

	at org.eclipse.jdt.core.groovy.tests.search.BinarySearchTests.assertMatches(BinarySearchTests.java:139)
	at org.eclipse.jdt.core.groovy.tests.search.BinarySearchTests.testClassDecl1(BinarySearchTests.java:165)
Collapse Failed BinarySearchTests testFieldRefInInitializer History
1 sec
java.lang.AssertionError: Expecting 1 matches, but found 0

java.lang.AssertionError: 
Expecting 1 matches, but found 0

	at org.eclipse.jdt.core.groovy.tests.search.BinarySearchTests.assertMatches(BinarySearchTests.java:139)
	at org.eclipse.jdt.core.groovy.tests.search.BinarySearchTests.testFieldRefInInitializer(BinarySearchTests.java:208)
Collapse Failed ConstructorReferenceSearchTests testConstructorReferences12a History
< 1 sec
java.lang.AssertionError: expected:<3> but was:<0>
	at org.eclipse.jdt.core.groovy.tests.search.ConstructorReferenceSearchTests.testConstructorReferences12a(ConstructorReferenceSearchTests.java:332)
Collapse Failed ConstructorReferenceSearchTests testNewifyConstructorReferences1 History
< 1 sec
java.lang.AssertionError: expected:<2> but was:<0>
	at org.eclipse.jdt.core.groovy.tests.search.ConstructorReferenceSearchTests.testNewifyConstructorReferences1(ConstructorReferenceSearchTests.java:387)
Collapse Failed DGMInferencingTests testDGSMDeclaring5 History
< 1 sec
java.lang.AssertionError: Expected declaring type not found.
 Expected: org.codehaus.groovy.runtime.DefaultGroovyStaticMethods
 Found type: java.lang.String
 Found declaring type: java.util.regex.Matcher
 ASTNode: org.codehaus.groovy.ast.expr.ConstantExpression@ee9ff[getLastMatcher]
java.lang.AssertionError: 
Expected declaring type not found.
	Expected: org.codehaus.groovy.runtime.DefaultGroovyStaticMethods
(5 more lines...)
Collapse Failed GenericInferencingTests testList10 History
< 1 sec
java.lang.AssertionError: Expected type not found.
Expected: java.util.List<java.lang.String>
Found: java.util.List<java.lang.Object>
Declaring type: Search
ASTNode: org.codehaus.groovy.ast.expr.VariableExpression@e9ecc[variable: xxx]
Confidence: INFERRED

java.lang.AssertionError: 
(8 more lines...)
Collapse Failed TypeReferenceSearchTests testFindClassDeclarationWithPattern History
< 1 sec
java.lang.AssertionError: Expected but not found: SongTests (not open) [in SongTests.groovy [in gtunes [in src [in Project]]]]
Expected but not found: ArtistTests (not open) [in ArtistTests.groovy [in gtunes [in src [in Project]]]]
Found but not expected: class ArtistTests [in ArtistTests.groovy [in src.gtunes [in <project root> [in Project]]]]
  java.lang.Object testSomething()
Found but not expected: class SongTests [in SongTests.groovy [in src.gtunes [in <project root> [in Project]]]]
  java.lang.Object testSomething()

java.lang.AssertionError: 
(9 more lines...)
Fixed tests 4
Status Test Failing since Duration
Successful BuildAccessRulesTests testAccessForImplements History
Failing since build #181 (Code changes detected) < 1 sec
Successful BinarySearchTests testClassDecl2 History
Failing since build #181 (Code changes detected) 1 sec
Successful ClosureInferencingTests testClosure11 History
Failing since build #181 (Code changes detected) < 1 sec
Successful DGMInferencingTests testDGMClosure20 History
Failing since build #181 (Code changes detected) < 1 sec

Error summary

The build generated some errors. See the full build log for more details.

Jan 15, 2020 9:32:18 PM org.apache.http.impl.execchain.RetryExec execute
INFO: I/O exception (org.apache.http.NoHttpResponseException) caught when processing request to {s}->https://download.eclipse.org:443: The target server failed to respond
Jan 15, 2020 9:32:18 PM org.apache.http.impl.execchain.RetryExec execute
INFO: Retrying request to {s}->https://download.eclipse.org:443
SWT SessionManagerDBus: Failed to connect to org.gnome.SessionManager: Failed to execute child process “dbus-launch” (No such file or directory)
SWT SessionManagerDBus: Failed to connect to org.xfce.SessionManager: Failed to execute child process “dbus-launch” (No such file or directory)
TypeInferencingVisitorWithRequestor.findMethodNode: no match found for Main.main([Qjava.lang.String;)
TypeInferencingVisitorWithRequestor.findMethodNode: no match found for Main.main([Qjava.lang.String;)
CodeSelectRequestor: Could not proceed due to null declaring type for org.codehaus.groovy.ast.expr.BinaryExpression@ecbea[org.codehaus.groovy.ast.expr.VariableExpression@ecbe3[variable: it]("in" at 1:20:  "in" )org.codehaus.groovy.ast.expr.ListExpression@ee270[]]
CodeSelectRequestor: Could not proceed due to null declaring type for org.codehaus.groovy.ast.expr.RangeExpression@ebcdd
CodeSelectRequestor: Could not proceed due to null declaring type for org.codehaus.groovy.ast.expr.RangeExpression@ebcde
TypeInferencingVisitorWithRequestor.findMethodNode: no match found for Type.x(QList<Qjava.util.Date;>;)
TypeInferencingVisitorWithRequestor.findMethodNode: no match found for Type.x(QList<Qjava.lang.Number;>;)
TypeInferencingVisitorWithRequestor.findMethodNode: no match found for Type.x(QList<Qjava.lang.Number;>;)
TypeInferencingVisitorWithRequestor.findMethodNode: no match found for Type.x(QList<Qjava.util.Date;>;)
TypeInferencingVisitorWithRequestor.findMethodNode: no match found for Type.x(QList<Qjava.lang.Number;>;)
CodeSelectRequestor: Could not proceed due to null declaring type for org.codehaus.groovy.ast.expr.ConstantExpression@e8fc6[fff]
CodeSelectRequestor: Could not proceed due to null declaring type for org.codehaus.groovy.ast.expr.ConstantExpression@e8fca[fff]
CodeSelectRequestor: Could not proceed due to null declaring type for org.codehaus.groovy.ast.expr.ConstantExpression@e8fca[fff]
Waiting for: Java indexing... 22 files to index (/Project)
Waiting for: Java indexing... 22 files to index (/Project)
Waiting for: Java indexing... 22 files to index (/Project)
Waiting for: Java indexing... 22 files to index (/Project)
Waiting for: Java indexing... 22 files to index (/Project)
Waiting for: Java indexing... 22 files to index (/Project)
Waiting for: Java indexing... 22 files to index (/Project)
Waiting for: Java indexing... 21 files to index (/Project)
Waiting for: Java indexing... 21 files to index (/Project)
Waiting for: Flushing content description cache.
Waiting for: Java indexing... 21 files to index (/Project)
Waiting for: Java indexing... 17 files to index (/opt/jdk8u232-b09/jre/lib/rt.jar)