Build: #197 failed

Job: Default Job failed

Stages & jobs

  1. Default Stage

Job result summary

Completed
Duration
94 minutes
Agent
bamboo-19.af.pivotal.io
Revision
66cf4682eb9b5a7511d2886521cdf72e8df61eae 66cf4682eb9b5a7511d2886521cdf72e8df61eae
Total tests
6286
Failing since
#188 (Code changes detected – )
Fixed in
#199 (Code changes detected)

Tests

  • 6,286 tests in total
  • 9 tests failed
  • 5 failures are new
  • 3 tests were fixed
  • 140 tests were quarantined / skipped
  • 89 minutes taken in total.
New test failures 5
Status Test Duration
Collapse Failed BinarySearchTests testMethodDecl History
1 sec
java.lang.AssertionError: Expecting 4 matches, but found 0

java.lang.AssertionError: 
Expecting 4 matches, but found 0

	at org.eclipse.jdt.core.groovy.tests.search.BinarySearchTests.assertMatches(BinarySearchTests.java:139)
	at org.eclipse.jdt.core.groovy.tests.search.BinarySearchTests.testMethodDecl(BinarySearchTests.java:199)
Collapse Failed ClosureInferencingTests testNestedClosure11 History
< 1 sec
java.lang.AssertionError: Expected type not found.
Expected: java.lang.Integer
Found: Search
Declaring type: groovy.lang.Closure<V extends java.lang.Object>
ASTNode: org.codehaus.groovy.ast.expr.ConstantExpression@f9e59[delegate]
Confidence: INFERRED

java.lang.AssertionError: 
(8 more lines...)
Collapse Failed ConstructorReferenceSearchTests testConstructorReferences4 History
< 1 sec
java.lang.AssertionError: expected:<2> but was:<0>
	at org.eclipse.jdt.core.groovy.tests.search.ConstructorReferenceSearchTests.testConstructorReferences4(ConstructorReferenceSearchTests.java:144)
Collapse Failed ConstructorReferenceSearchTests testConstructorReferences7 History
< 1 sec
java.lang.AssertionError: expected:<1> but was:<0>
	at org.eclipse.jdt.core.groovy.tests.search.ConstructorReferenceSearchTests.testConstructorReferences7(ConstructorReferenceSearchTests.java:198)
Collapse Failed MethodReferenceSearchTests testGenericsMethodReferenceSearch History
< 1 sec
java.lang.AssertionError: expected:<1> but was:<0>
	at org.eclipse.jdt.core.groovy.tests.search.MethodReferenceSearchTests.testGenericsMethodReferenceSearch(MethodReferenceSearchTests.java:810)
Existing test failures 4
Status Test Failing since Duration
junit.framework.AssertionFailedError: Method is marked with @NotYetImplemented but passes unexpectedly
	at org.codehaus.groovy.eclipse.refactoring.test.extract.ConvertLocalToFieldTests.testWithinFieldInitializer1(ConvertLocalToFieldTests.groovy:205)
java.lang.VerifyError: (class: Expression$9fffe3e5$3e3d$4c65$b714$7ce76ef8617c, method: $getStaticMetaClass signature: ()Lgroovy/lang/MetaClass;) Illegal type in constant pool
	at org.codehaus.groovy.eclipse.refactoring.test.rename.RenameFieldTests.runTest(RenameFieldTests.groovy:82)
	at org.codehaus.groovy.eclipse.refactoring.test.rename.RenameFieldTests.runTest(RenameFieldTests.groovy)
	at org.codehaus.groovy.eclipse.refactoring.test.rename.RenameFieldTests.test15(RenameFieldTests.groovy:227)
java.lang.VerifyError: (class: Expression$123f9547$02a6$447f$8f6a$bd7bd81042bd, method: $getStaticMetaClass signature: ()Lgroovy/lang/MetaClass;) Illegal type in constant pool
	at org.codehaus.groovy.eclipse.refactoring.test.rename.RenameMethodTests.runTest(RenameMethodTests.groovy:50)
	at org.codehaus.groovy.eclipse.refactoring.test.rename.RenameMethodTests.runTest(RenameMethodTests.groovy)
	at org.codehaus.groovy.eclipse.refactoring.test.rename.RenameMethodTests.test12(RenameMethodTests.groovy:138)
java.lang.VerifyError: (class: Expression$224dec8e$bede$4ea2$839e$07e5d7935110, method: $getStaticMetaClass signature: ()Lgroovy/lang/MetaClass;) Illegal type in constant pool
	at org.codehaus.groovy.eclipse.refactoring.test.rename.RenameMethodTests.runTest(RenameMethodTests.groovy:50)
	at org.codehaus.groovy.eclipse.refactoring.test.rename.RenameMethodTests.runTest(RenameMethodTests.groovy:37)
	at org.codehaus.groovy.eclipse.refactoring.test.rename.RenameMethodTests.test14(RenameMethodTests.groovy:150)
Fixed tests 3
Status Test Failing since Duration
Successful BasicGroovyBuildTests testTags3 History
Failing since build #196 (Code changes detected) < 1 sec
Successful ClosureInferencingTests testWithAndClosure1 History
Failing since build #196 (Code changes detected) < 1 sec
Successful DGMInferencingTests testDGM7 History
Failing since build #196 (Code changes detected) < 1 sec

Error summary

The build generated some errors. See the full build log for more details.

Jan 30, 2020 11:20:52 PM org.apache.http.impl.execchain.RetryExec execute
INFO: I/O exception (org.apache.http.NoHttpResponseException) caught when processing request to {s}->https://download.eclipse.org:443: The target server failed to respond
Jan 30, 2020 11:20:52 PM org.apache.http.impl.execchain.RetryExec execute
INFO: Retrying request to {s}->https://download.eclipse.org:443
SWT SessionManagerDBus: Failed to connect to org.gnome.SessionManager: Failed to execute child process “dbus-launch” (No such file or directory)
SWT SessionManagerDBus: Failed to connect to org.xfce.SessionManager: Failed to execute child process “dbus-launch” (No such file or directory)
TypeInferencingVisitorWithRequestor.findMethodNode: no match found for Main.main([Qjava.lang.String;)
TypeInferencingVisitorWithRequestor.findMethodNode: no match found for Main.main([Qjava.lang.String;)
CodeSelectRequestor: Could not proceed due to null declaring type for org.codehaus.groovy.ast.expr.BinaryExpression@ecbea[org.codehaus.groovy.ast.expr.VariableExpression@ecbe3[variable: it]("in" at 1:20:  "in" )org.codehaus.groovy.ast.expr.ListExpression@ee270[]]
CodeSelectRequestor: Could not proceed due to null declaring type for org.codehaus.groovy.ast.expr.RangeExpression@ebcdd
CodeSelectRequestor: Could not proceed due to null declaring type for org.codehaus.groovy.ast.expr.RangeExpression@ebcde
TypeInferencingVisitorWithRequestor.findMethodNode: no match found for Type.x(QList<Qjava.util.Date;>;)
TypeInferencingVisitorWithRequestor.findMethodNode: no match found for Type.x(QList<Qjava.lang.Number;>;)
TypeInferencingVisitorWithRequestor.findMethodNode: no match found for Type.x(QList<Qjava.lang.Number;>;)
TypeInferencingVisitorWithRequestor.findMethodNode: no match found for Type.x(QList<Qjava.util.Date;>;)
TypeInferencingVisitorWithRequestor.findMethodNode: no match found for Type.x(QList<Qjava.lang.Number;>;)
TypeInferencingVisitorWithRequestor.findMethodNode: no match found for Type.x(QList<Qjava.lang.Number;>;)
CodeSelectRequestor: Could not proceed due to null declaring type for org.codehaus.groovy.ast.expr.ConstantExpression@e8fc6[fff]
CodeSelectRequestor: Could not proceed due to null declaring type for org.codehaus.groovy.ast.expr.ConstantExpression@e8fca[fff]
CodeSelectRequestor: Could not proceed due to null declaring type for org.codehaus.groovy.ast.expr.ConstantExpression@e8fca[fff]
Waiting for: Java indexing... 22 files to index (/Project)
Waiting for: Java indexing... 22 files to index (/Project)
Waiting for: Java indexing... 22 files to index (/Project)
Waiting for: Java indexing... 22 files to index (/Project)
Waiting for: Java indexing... 22 files to index (/Project)
Waiting for: Java indexing... 22 files to index (/Project)
Waiting for: Java indexing... 4 files to index (/opt/bamboo-home/xml-data/build-dir/GRECLIPSE-E413-JOB1/ide-test/org.codehaus.groovy.alltests/target/work/plugins/org.eclipse.jdt.groovy.core.tests.builder_3.7.0.v202001302320-e1909/lib/binGroovySearch.jar)
Waiting for: Java indexing... 21 files to index (/Project)
Waiting for: Java indexing... 21 files to index (/Project)
Waiting for: Java indexing... 21 files to index (/Project)
Waiting for: Java indexing... 15 files to index (/opt/jdk8u232-b09/jre/lib/rt.jar)