Build: #3 failed

Job: Default Job failed

Stages & jobs

  1. Default Stage

Test results

  • 5,848 tests in total
  • 2 tests failed
  • 2 failures are new
  • 103 tests were quarantined / skipped
  • 98 minutes taken in total.

Build 3 has the following 2 errors: 2 new failure(s) occurred since the previous build.

New test failures 2
Status Test Duration
Collapse Failed BasicGroovyBuildTests testTaskMarkerInMultiLineCommentButOnOneLine History
< 1 sec
java.lang.AssertionError: missing expected problem: Problem : todonothing [ resource : </Project/src/p/A.groovy> range : <16,29> category : <-1> severity : <2>]
	at org.eclipse.jdt.core.groovy.tests.builder.BasicGroovyBuildTests.testTaskMarkerInMultiLineCommentButOnOneLine(BasicGroovyBuildTests.java:2586)
Collapse Failed DGMInferencingTests testDGM7 History
< 1 sec
java.lang.AssertionError: Expected type not found.
Expected: java.lang.String
Found: java.lang.Object
Declaring type: Search
ASTNode: org.codehaus.groovy.ast.expr.VariableExpression@f0080[variable: key]
Confidence: INFERRED

java.lang.AssertionError: 
(9 more lines...)