Build: #416 failed

Job: Default Job failed

Stages & jobs

  1. Default Stage

Job result summary

Completed
Duration
100 minutes
Agent
bamboo-11.af.pivotal.io
Revision
091e156cfe0977c0c261f7a5c944d9cecaf2f6cb 091e156cfe0977c0c261f7a5c944d9cecaf2f6cb
Total tests
6760
Failing since
#414 (Code changes detected – )
Fixed in
#420 (Code changes detected)

Tests

  • 6,760 tests in total
  • 6 tests failed
  • 6 failures are new
  • 3 tests were fixed
  • 147 tests were quarantined / skipped
  • 96 minutes taken in total.
New test failures 6
Status Test Duration
Collapse Failed BasicGroovyBuildTests testProjectBasedirAsOutputLocation History
< 1 sec
org.junit.ComparisonFailure: unexpected recompiled units. lenExpected=1 lenActual=2 expected:<{p.Script[]}> but was:<{p.Script[,p.Script]}>
	at org.eclipse.jdt.core.groovy.tests.builder.BasicGroovyBuildTests.testProjectBasedirAsOutputLocation(BasicGroovyBuildTests.java:400)
Collapse Failed GroovyContentTypeTests testGroovyThenJavaProject History
< 1 sec
java.lang.AssertionError: L/Project/bin/p1/HelloJava.class should exist
	at org.eclipse.jdt.core.groovy.tests.model.GroovyContentTypeTests.checkJavaProject(GroovyContentTypeTests.java:152)
	at org.eclipse.jdt.core.groovy.tests.model.GroovyContentTypeTests.testGroovyThenJavaProject(GroovyContentTypeTests.java:90)
Collapse Failed ClosureInferencingTests testClosure29 History
< 1 sec
java.lang.AssertionError: Expected type not found.
Expected: java.lang.Void
Found: java.lang.Integer
Declaring type: Search
ASTNode: org.codehaus.groovy.ast.expr.VariableExpression@3ba57db[variable: bar]
Confidence: INFERRED

java.lang.AssertionError: 
(8 more lines...)
Collapse Failed ConstructorReferenceSearchTests testConstructorReferences12a History
< 1 sec
java.lang.AssertionError: expected:<1> but was:<0>
	at org.eclipse.jdt.core.groovy.tests.search.ConstructorReferenceSearchTests.testConstructorReferences12a(ConstructorReferenceSearchTests.java:353)
Collapse Failed DGMInferencingTests testDGM38 History
< 1 sec
java.lang.AssertionError: Expected type not found.
Expected: java.io.BufferedWriter
Found: java.lang.Object
Declaring type: groovy.lang.Closure<V extends java.lang.Object>
ASTNode: org.codehaus.groovy.ast.expr.VariableExpression@1e547236[variable: it]
Confidence: INFERRED

java.lang.AssertionError: 
(9 more lines...)
Collapse Failed MethodReferenceSearchTests testExplicitPropertySetterSearch3 History
1 sec
java.lang.AssertionError: expected:<3> but was:<0>
	at org.eclipse.jdt.core.groovy.tests.search.MethodReferenceSearchTests.testExplicitPropertySetterSearch3(MethodReferenceSearchTests.java:874)
Fixed tests 3
Status Test Failing since Duration
Successful BasicGroovyBuildTests testSpock_GRE558 History
1 sec
Successful BasicGroovyBuildTests testSpock_GRE605_1 History
< 1 sec
Successful BasicGroovyBuildTests testSpock_GRE605_2 History
< 1 sec

Error summary

The build generated some errors. See the full build log for more details.

Aug 20, 2020 11:00:25 PM org.apache.http.impl.execchain.RetryExec execute
INFO: I/O exception (org.apache.http.NoHttpResponseException) caught when processing request to {s}->https://download.eclipse.org:443: The target server failed to respond
Aug 20, 2020 11:00:25 PM org.apache.http.impl.execchain.RetryExec execute
INFO: Retrying request to {s}->https://download.eclipse.org:443
SWT SessionManagerDBus: Failed to connect to org.gnome.SessionManager: Failed to execute child process “dbus-launch” (No such file or directory)
SWT SessionManagerDBus: Failed to connect to org.xfce.SessionManager: Failed to execute child process “dbus-launch” (No such file or directory)
TypeInferencingVisitorWithRequestor.findMethodNode: no match found for Main.main([Qjava.lang.String;)
TypeInferencingVisitorWithRequestor.findMethodNode: no match found for Main.main([Qjava.lang.String;)
CodeSelectRequestor: Could not proceed due to null declaring type for org.codehaus.groovy.ast.expr.BinaryExpression@6c2f3d73[org.codehaus.groovy.ast.expr.VariableExpression@99fde9f[variable: it]("in" at 1:20:  "in" )org.codehaus.groovy.ast.expr.ListExpression@4ccd1016[]]
CodeSelectRequestor: Could not proceed due to null declaring type for org.codehaus.groovy.ast.expr.RangeExpression@7c34fec2
CodeSelectRequestor: Could not proceed due to null declaring type for org.codehaus.groovy.ast.expr.RangeExpression@38891e5
CodeSelectRequestor: Could not proceed due to null declaring type for org.codehaus.groovy.ast.expr.ClosureExpression@692e6703null{ org.codehaus.groovy.ast.stmt.BlockStatement@21ce71e3[] }
CodeSelectRequestor: Could not proceed due to null declaring type for org.codehaus.groovy.ast.expr.ClosureExpression@7d6b7e11null{ org.codehaus.groovy.ast.stmt.BlockStatement@691bca4b[org.codehaus.groovy.ast.stmt.ReturnStatement@204c67f7[expression:org.codehaus.groovy.ast.expr.ConstantExpression@399fd88e[null]]] }
CodeSelectRequestor: Could not proceed due to null declaring type for org.codehaus.groovy.ast.expr.ClosureExpression@2f25b390[org.codehaus.groovy.ast.Parameter@21bbc8ad[name:param type: java.lang.String, hasDefaultValue: false]]{ org.codehaus.groovy.ast.stmt.BlockStatement@12d1db25[org.codehaus.groovy.ast.stmt.ReturnStatement@19a3a7ef[expression:org.codehaus.groovy.ast.expr.ConstantExpression@4e233c83[null]]] }
CodeSelectRequestor: Could not proceed due to null declaring type for org.codehaus.groovy.ast.expr.MapEntryExpression@4c772286(key: org.codehaus.groovy.ast.expr.ConstantExpression@3c6eadfc[foo], value: org.codehaus.groovy.ast.expr.ConstantExpression@3eb60674[bar])
CodeSelectRequestor: Could not proceed due to null declaring type for org.codehaus.groovy.ast.expr.SpreadMapExpression@3efafd98
CodeSelectRequestor: Could not proceed due to null declaring type for org.codehaus.groovy.ast.expr.ConstantExpression@47f952c6[foo]
CodeSelectRequestor: Could not proceed due to null declaring type for org.codehaus.groovy.ast.expr.ConstantExpression@613bc805[foo]
CodeSelectRequestor: Could not proceed due to null declaring type for org.codehaus.groovy.ast.expr.ConstantExpression@75d04063[foo]
TypeInferencingVisitorWithRequestor.findMethodNode: no match found for Type.x(QList<Qjava.util.Date;>;)
TypeInferencingVisitorWithRequestor.findMethodNode: no match found for Type.x(QList<Qjava.lang.Number;>;)
TypeInferencingVisitorWithRequestor.findMethodNode: no match found for Type.x(QList<Qjava.util.Date;>;)
TypeInferencingVisitorWithRequestor.findMethodNode: no match found for Type.x(QList<Qjava.lang.Number;>;)
TypeInferencingVisitorWithRequestor.findMethodNode: no match found for Type.x(QList<Qjava.lang.Number;>;)
CodeSelectRequestor: Could not proceed due to null declaring type for org.codehaus.groovy.ast.expr.ConstantExpression@5ab7a858[fff]
CodeSelectRequestor: Could not proceed due to null declaring type for org.codehaus.groovy.ast.expr.ConstantExpression@1cc0ccd8[fff]
CodeSelectRequestor: Could not proceed due to null declaring type for org.codehaus.groovy.ast.expr.ConstantExpression@14377861[fff]
Waiting for: Java indexing... 3 files to index (/Project)
Waiting for: Java indexing... 24 files to index (/Project)
Waiting for: Java indexing... 24 files to index (/Project)
Waiting for: Java indexing... 24 files to index (/Project)
Waiting for: Java indexing... 24 files to index (/Project)
Waiting for: Java indexing... 4 files to index (/opt/bamboo-home/xml-data/build-dir/GRECLIPSE-E413-JOB1/ide-test/org.codehaus.groovy.alltests/target/work/plugins/org.eclipse.jdt.groovy.core.tests.builder_3.9.0.v202008202300-e1909/lib/binGroovySearch.jar)
Waiting for: Java indexing... 24 files to index (/Project)
Waiting for: Java indexing... 23 files to index (/Project)
Waiting for: Java indexing... 23 files to index (/Project)
Waiting for: Java indexing... 23 files to index (/Project)
Waiting for: Java indexing... 3 files to index (/Project)