Build: #424 failed

Job: Default Job failed

Stages & jobs

  1. Default Stage

Job result summary

Completed
Duration
101 minutes
Agent
bamboo-11.af.pivotal.io
Revision
076d14c796b6f5fe64ece95b6cb4254bb3bf0354 076d14c796b6f5fe64ece95b6cb4254bb3bf0354
Total tests
6788
Failing since
#423 (Code changes detected – )
Fixed in
#425 (Code changes detected)

Tests

  • 6,788 tests in total
  • 7 tests failed
  • 7 failures are new
  • 3 tests were fixed
  • 144 tests were quarantined / skipped
  • 96 minutes taken in total.
New test failures 7
Status Test Duration
Collapse Failed SyntheticMemberSearchTests testSearchInGroovy1 History
1 sec
java.lang.AssertionError: Wrong number of matches found in:
 expected:<3> but was:<0>
java.lang.AssertionError: 
Wrong number of matches found in:
 expected:<3> but was:<0>
	at org.codehaus.groovy.eclipse.core.test.SyntheticMemberSearchTests.assertCount(SyntheticMemberSearchTests.groovy:272)
	at org.codehaus.groovy.eclipse.core.test.SyntheticMemberSearchTests.testSearchInGroovy1(SyntheticMemberSearchTests.groovy:60)
Collapse Failed SyntheticMemberSearchTests testSearchInJava1 History
4 secs
java.lang.AssertionError: Wrong number of matches found in:
 expected:<3> but was:<0>
java.lang.AssertionError: 
Wrong number of matches found in:
 expected:<3> but was:<0>
	at org.codehaus.groovy.eclipse.core.test.SyntheticMemberSearchTests.assertCount(SyntheticMemberSearchTests.groovy:272)
	at org.codehaus.groovy.eclipse.core.test.SyntheticMemberSearchTests.testSearchInJava1(SyntheticMemberSearchTests.groovy:159)
Collapse Failed SyntheticMemberSearchTests testSearchInJava2 History
1 sec
java.lang.AssertionError: Wrong number of matches found in:
 expected:<1> but was:<0>
java.lang.AssertionError: 
Wrong number of matches found in:
 expected:<1> but was:<0>
	at org.codehaus.groovy.eclipse.core.test.SyntheticMemberSearchTests.assertCount(SyntheticMemberSearchTests.groovy:272)
	at org.codehaus.groovy.eclipse.core.test.SyntheticMemberSearchTests.testSearchInJava2(SyntheticMemberSearchTests.groovy:181)
Collapse Failed SyntheticMemberSearchTests testSearchInJava3 History
< 1 sec
java.lang.AssertionError: Wrong number of matches found in:
 expected:<1> but was:<0>
java.lang.AssertionError: 
Wrong number of matches found in:
 expected:<1> but was:<0>
	at org.codehaus.groovy.eclipse.core.test.SyntheticMemberSearchTests.assertCount(SyntheticMemberSearchTests.groovy:272)
	at org.codehaus.groovy.eclipse.core.test.SyntheticMemberSearchTests.testSearchInJava3(SyntheticMemberSearchTests.groovy:203)
Collapse Failed SyntheticMemberSearchTests testSearchInJava4 History
1 sec
java.lang.AssertionError: Wrong number of matches found in:
 expected:<1> but was:<0>
java.lang.AssertionError: 
Wrong number of matches found in:
 expected:<1> but was:<0>
	at org.codehaus.groovy.eclipse.core.test.SyntheticMemberSearchTests.assertCount(SyntheticMemberSearchTests.groovy:272)
	at org.codehaus.groovy.eclipse.core.test.SyntheticMemberSearchTests.testSearchInJava4(SyntheticMemberSearchTests.groovy:225)
Collapse Failed DGMInferencingTests testDGM29 History
< 1 sec
java.lang.AssertionError: Expected type not found.
Expected: java.io.FileOutputStream
Found: java.lang.Object
Declaring type: groovy.lang.Closure<V extends java.lang.Object>
ASTNode: org.codehaus.groovy.ast.expr.VariableExpression@224fee16[variable: it]
Confidence: INFERRED

java.lang.AssertionError: 
(9 more lines...)
Collapse Failed MethodReferenceSearchTests testMethodWithDefaultParameters4 History
< 1 sec
java.lang.AssertionError: expected:<0> but was:<1>
	at org.eclipse.jdt.core.groovy.tests.search.MethodReferenceSearchTests.testMethodWithDefaultParameters4(MethodReferenceSearchTests.java:477)
Fixed tests 3
Status Test Failing since Duration
Successful BasicGroovyBuildTests testProjectCompilerConfigScript1 History
Failing since build #423 (Code changes detected) < 1 sec
Successful ConstructorReferenceSearchTests testConstructorReferences2 History
Failing since build #423 (Code changes detected) < 1 sec
Successful InferencingTests testMethodOverloadsArgumentMatching7 History
Failing since build #423 (Code changes detected) < 1 sec

Error summary

The build generated some errors. See the full build log for more details.

SWT SessionManagerDBus: Failed to connect to org.gnome.SessionManager: Failed to execute child process “dbus-launch” (No such file or directory)
SWT SessionManagerDBus: Failed to connect to org.xfce.SessionManager: Failed to execute child process “dbus-launch” (No such file or directory)
TypeInferencingVisitorWithRequestor.findMethodNode: no match found for Main.main([Qjava.lang.String;)
TypeInferencingVisitorWithRequestor.findMethodNode: no match found for Main.main([Qjava.lang.String;)
CodeSelectRequestor: Could not proceed due to null declaring type for org.codehaus.groovy.ast.expr.BinaryExpression@11ba3244[org.codehaus.groovy.ast.expr.VariableExpression@490a90c5[variable: it]("in" at 1:20:  "in" )org.codehaus.groovy.ast.expr.ListExpression@7d06aedc[]]
CodeSelectRequestor: Could not proceed due to null declaring type for org.codehaus.groovy.ast.expr.RangeExpression@33a5df94
CodeSelectRequestor: Could not proceed due to null declaring type for org.codehaus.groovy.ast.expr.RangeExpression@a087ab7
CodeSelectRequestor: Could not proceed due to null declaring type for org.codehaus.groovy.ast.expr.ClosureExpression@1ebb71adnull{ org.codehaus.groovy.ast.stmt.BlockStatement@5f9361ee[] }
CodeSelectRequestor: Could not proceed due to null declaring type for org.codehaus.groovy.ast.expr.ClosureExpression@71b8d2a9null{ org.codehaus.groovy.ast.stmt.BlockStatement@1915f02a[org.codehaus.groovy.ast.stmt.ReturnStatement@6b2d6f92[expression:org.codehaus.groovy.ast.expr.ConstantExpression@20f42160[null]]] }
CodeSelectRequestor: Could not proceed due to null declaring type for org.codehaus.groovy.ast.expr.ClosureExpression@4c7e7c44[org.codehaus.groovy.ast.Parameter@295df756[name:param type: java.lang.String, hasDefaultValue: false]]{ org.codehaus.groovy.ast.stmt.BlockStatement@38b3a306[org.codehaus.groovy.ast.stmt.ReturnStatement@2492af09[expression:org.codehaus.groovy.ast.expr.ConstantExpression@4d8db4d4[null]]] }
CodeSelectRequestor: Could not proceed due to null declaring type for org.codehaus.groovy.ast.expr.MapEntryExpression@69e3ea8a(key: org.codehaus.groovy.ast.expr.ConstantExpression@797082ee[foo], value: org.codehaus.groovy.ast.expr.ConstantExpression@1211a255[bar])
CodeSelectRequestor: Could not proceed due to null declaring type for org.codehaus.groovy.ast.expr.SpreadMapExpression@733b7028
CodeSelectRequestor: Could not proceed due to null declaring type for org.codehaus.groovy.ast.expr.ConstantExpression@780437f2[foo]
CodeSelectRequestor: Could not proceed due to null declaring type for org.codehaus.groovy.ast.expr.ConstantExpression@57bd7789[foo]
CodeSelectRequestor: Could not proceed due to null declaring type for org.codehaus.groovy.ast.expr.ConstantExpression@6cdc4eea[foo]
TypeInferencingVisitorWithRequestor.findMethodNode: no match found for Type.x(QList<Qjava.util.Date;>;)
TypeInferencingVisitorWithRequestor.findMethodNode: no match found for Type.x(QList<Qjava.lang.Number;>;)
TypeInferencingVisitorWithRequestor.findMethodNode: no match found for Type.x(QList<Qjava.lang.Number;>;)
TypeInferencingVisitorWithRequestor.findMethodNode: no match found for Type.x(QList<Qjava.util.Date;>;)
TypeInferencingVisitorWithRequestor.findMethodNode: no match found for Type.x(QList<Qjava.lang.Number;>;)
CodeSelectRequestor: Could not proceed due to null declaring type for org.codehaus.groovy.ast.expr.ConstantExpression@36972563[fff]
CodeSelectRequestor: Could not proceed due to null declaring type for org.codehaus.groovy.ast.expr.ConstantExpression@2655ed9e[fff]
CodeSelectRequestor: Could not proceed due to null declaring type for org.codehaus.groovy.ast.expr.ConstantExpression@1f9a9870[fff]
V=? extends java.lang.Number
V=? extends java.lang.Number
V=? extends java.lang.Number
V=? extends java.lang.Number
T=?
E=?
T=?
T=?
E=?
T=?
E=? super Shape
E=? super Shape
V=? extends java.lang.Number
V=? extends java.lang.Number
V=? extends java.lang.Number
V=? extends java.lang.Number
T=?
E=?
T=?
T=?
E=?
T=?
E=? super Shape
E=? super Shape
Waiting for: Java indexing... 3 files to index (/opt/bamboo-home/xml-data/build-dir/GRECLIPSE-E413-JOB1/ide-test/org.codehaus.groovy.alltests/target/work/plugins/org.eclipse.jdt.groovy.core.tests.builder_3.9.0.v202009012300-e1909/lib/binGroovySearch.jar)
Waiting for: Java indexing... 24 files to index (/Project)
Waiting for: Java indexing... 24 files to index (/Project)
Waiting for: Java indexing... 24 files to index (/Project)
Waiting for: Java indexing... 24 files to index (/Project)
Waiting for: Java indexing... 24 files to index (/Project)
Waiting for: Java indexing... 24 files to index (/Project)
Waiting for: Java indexing... 23 files to index (/Project)
Waiting for: Java indexing... 23 files to index (/Project)
Waiting for: Flushing content description cache.
Waiting for: Java indexing... 3 files to index (/Project)
Waiting for: Java indexing... 5 files to index (/Project)
Waiting for: Flushing content description cache.