Build: #436 failed

Job: Default Job failed

Stages & jobs

  1. Default Stage

Job result summary

Completed
Duration
112 minutes
Agent
bamboo-10.af.pivotal.io
Revision
e6d3b29a96bc820102ad94b8b6554b505877da04 e6d3b29a96bc820102ad94b8b6554b505877da04
Total tests
6816
Failing since
#433 (Code changes detected – )
Fixed in
#437 (Code changes detected)

Tests

  • 6,816 tests in total
  • 2 tests failed
  • 2 failures are new
  • 1 test was fixed
  • 144 tests were quarantined / skipped
  • 107 minutes taken in total.
New test failures 2
Status Test Duration
Collapse Failed ConstructorReferenceSearchTests testConstructorReferences11a History
< 1 sec
java.lang.AssertionError: expected:<1> but was:<0>
	at org.eclipse.jdt.core.groovy.tests.search.ConstructorReferenceSearchTests.testConstructorReferences11a(ConstructorReferenceSearchTests.java:292)
Collapse Failed InferencingTests testLocalTypeAndDefaultImportCollision History
< 1 sec
java.lang.AssertionError: Expected type not found.
Expected: domain.Calendar
Found: java.lang.Object
Declaring type: java.lang.Object
ASTNode: org.codehaus.groovy.ast.expr.ConstantExpression@254eece5[instance]
Confidence: UNKNOWN

java.lang.AssertionError: 
(8 more lines...)
Fixed tests 1
Status Test Failing since Duration
Successful BasicGroovyBuildTests testIncrementalGenericsAndBinaryTypeBindings_GRE566 History
Failing since build #433 (Code changes detected) < 1 sec

Error summary

The build generated some errors. See the full build log for more details.

Sep 30, 2020 11:00:22 PM org.apache.http.impl.execchain.RetryExec execute
INFO: I/O exception (org.apache.http.NoHttpResponseException) caught when processing request to {s}->https://download.eclipse.org:443: The target server failed to respond
Sep 30, 2020 11:00:22 PM org.apache.http.impl.execchain.RetryExec execute
INFO: Retrying request to {s}->https://download.eclipse.org:443
SWT SessionManagerDBus: Failed to connect to org.gnome.SessionManager: Failed to execute child process “dbus-launch” (No such file or directory)
SWT SessionManagerDBus: Failed to connect to org.xfce.SessionManager: Failed to execute child process “dbus-launch” (No such file or directory)
TypeInferencingVisitorWithRequestor.findMethodNode: no match found for Main.main([Qjava.lang.String;)
TypeInferencingVisitorWithRequestor.findMethodNode: no match found for Main.main([Qjava.lang.String;)
CodeSelectRequestor: Could not proceed due to null declaring type for org.codehaus.groovy.ast.expr.BinaryExpression@63eb0c0c[org.codehaus.groovy.ast.expr.VariableExpression@784911f7[variable: it]("in" at 1:20:  "in" )org.codehaus.groovy.ast.expr.ListExpression@55b655b5[]]
CodeSelectRequestor: Could not proceed due to null declaring type for org.codehaus.groovy.ast.expr.RangeExpression@2e01bb05
CodeSelectRequestor: Could not proceed due to null declaring type for org.codehaus.groovy.ast.expr.RangeExpression@449bafd9
CodeSelectRequestor: Could not proceed due to null declaring type for org.codehaus.groovy.ast.expr.ClosureExpression@6fc5299anull{ org.codehaus.groovy.ast.stmt.BlockStatement@1116ed41[] }
CodeSelectRequestor: Could not proceed due to null declaring type for org.codehaus.groovy.ast.expr.ClosureExpression@55c848a2null{ org.codehaus.groovy.ast.stmt.BlockStatement@6ad546a6[org.codehaus.groovy.ast.stmt.ReturnStatement@462e731b[expression:org.codehaus.groovy.ast.expr.ConstantExpression@8810e38[null]]] }
CodeSelectRequestor: Could not proceed due to null declaring type for org.codehaus.groovy.ast.expr.ClosureExpression@59f95834[org.codehaus.groovy.ast.Parameter@56aff15b[name:param type: java.lang.String, hasDefaultValue: false]]{ org.codehaus.groovy.ast.stmt.BlockStatement@6e84fa3a[org.codehaus.groovy.ast.stmt.ReturnStatement@7b04db14[expression:org.codehaus.groovy.ast.expr.ConstantExpression@6631aec3[null]]] }
CodeSelectRequestor: Could not proceed due to null declaring type for org.codehaus.groovy.ast.expr.MapEntryExpression@34554ac7(key: org.codehaus.groovy.ast.expr.ConstantExpression@56f56cbf[foo], value: org.codehaus.groovy.ast.expr.ConstantExpression@18f077d8[bar])
CodeSelectRequestor: Could not proceed due to null declaring type for org.codehaus.groovy.ast.expr.SpreadMapExpression@71ef148a
CodeSelectRequestor: Could not proceed due to null declaring type for org.codehaus.groovy.ast.expr.ConstantExpression@19d825d0[foo]
CodeSelectRequestor: Could not proceed due to null declaring type for org.codehaus.groovy.ast.expr.ConstantExpression@1cdabee[foo]
CodeSelectRequestor: Could not proceed due to null declaring type for org.codehaus.groovy.ast.expr.ConstantExpression@79d1d9a2[foo]
TypeInferencingVisitorWithRequestor.findMethodNode: no match found for Type.x(QList<Qjava.util.Date;>;)
TypeInferencingVisitorWithRequestor.findMethodNode: no match found for Type.x(QList<Qjava.lang.Number;>;)
TypeInferencingVisitorWithRequestor.findMethodNode: no match found for Type.x(QList<Qjava.lang.Number;>;)
TypeInferencingVisitorWithRequestor.findMethodNode: no match found for Type.x(QList<Qjava.util.Date;>;)
TypeInferencingVisitorWithRequestor.findMethodNode: no match found for Type.x(QList<Qjava.lang.Number;>;)
TypeInferencingVisitorWithRequestor.findMethodNode: no match found for Type.x(QList<Qjava.lang.Number;>;)
CodeSelectRequestor: Could not proceed due to null declaring type for org.codehaus.groovy.ast.expr.ConstantExpression@44befe9[fff]
CodeSelectRequestor: Could not proceed due to null declaring type for org.codehaus.groovy.ast.expr.ConstantExpression@5543072e[fff]
CodeSelectRequestor: Could not proceed due to null declaring type for org.codehaus.groovy.ast.expr.ConstantExpression@60686a5a[fff]