Build: #582 failed

Job: Default Job failed

Stages & jobs

  1. Default Stage

Job result summary

Completed
Duration
97 minutes
Agent
bamboo-36.spring.vmware.com
Revision
08f6c3b15e20ec2425abbfd1f867920d91ba83e0 08f6c3b15e20ec2425abbfd1f867920d91ba83e0
Total tests
6181
Fixed in
#583 (Code changes detected)

Tests

  • 6,181 tests in total
  • 4 tests failed
  • 4 failures are new
  • 101 tests were quarantined / skipped
  • 89 minutes taken in total.
New test failures 4
Status Test Duration
Collapse Failed BasicGroovyBuildTests testBuildJavaHelloWorld History
< 1 sec
java.lang.AssertionError: array lengths differed, expected.length=1 actual.length=2
	at org.eclipse.jdt.core.groovy.tests.builder.BasicGroovyBuildTests.testBuildJavaHelloWorld(BasicGroovyBuildTests.java:204)
Collapse Failed BasicGroovyBuildTests testNoDoubleResolve History
< 1 sec
java.lang.AssertionError
	at org.eclipse.jdt.core.groovy.tests.builder.BasicGroovyBuildTests.testNoDoubleResolve(BasicGroovyBuildTests.java:2810)
Collapse Failed BasicGroovyBuildTests testProjectCompilerConfigScript2 History
< 1 sec
java.lang.AssertionError: array lengths differed, expected.length=1 actual.length=2
	at org.eclipse.jdt.core.groovy.tests.builder.BasicGroovyBuildTests.testProjectCompilerConfigScript2(BasicGroovyBuildTests.java:372)
Collapse Failed BasicGroovyBuildTests testSlow_GRE870 History
< 1 sec
java.lang.AssertionError: array lengths differed, expected.length=2 actual.length=4
	at org.eclipse.jdt.core.groovy.tests.builder.BasicGroovyBuildTests.testSlow_GRE870(BasicGroovyBuildTests.java:1567)

Error summary

The build generated some errors. See the full build log for more details.

Waiting for: Cleaning/Rebuilding Project: TestProject
Waiting for: Java indexing... 22 files to index (/TestProject)
Waiting for: Cleaning/Rebuilding Project: TestProject
Waiting for: Java indexing... 22 files to index (/TestProject)
Waiting for: Cleaning/Rebuilding Project: TestProject
Waiting for: Java indexing... 22 files to index (/TestProject)
Waiting for: Cleaning/Rebuilding Project: OtherProject
Waiting for: Cleaning/Rebuilding Project: P4
Waiting for: Java indexing... 22 files to index (/P4)
Waiting for: Cleaning/Rebuilding Project: P3
Waiting for: Cleaning/Rebuilding Project: P2
Waiting for: Cleaning/Rebuilding Project: P1
Waiting for: Java indexing... 22 files to index (/P1)
Waiting for: Cleaning/Rebuilding Project: P1a
Waiting for: Java indexing... 22 files to index (/P1a)
Waiting for: Cleaning/Rebuilding Project: P2a
Waiting for: Java indexing... 22 files to index (/P2a)
Waiting for: Cleaning/Rebuilding Project: OtherProject
Waiting for: Java indexing... 21 files to index (/TestProject)
Waiting for: Cleaning/Rebuilding Project: TestProject
Waiting for: Java indexing... 22 files to index (/TestProject)
CodeSelectRequestor: Could not proceed due to null declaring type for [email protected][fff]
CodeSelectRequestor: Could not proceed due to null declaring type for [email protected][fff]
CodeSelectRequestor: Could not proceed due to null declaring type for [email protected][fff]
Waiting for: Cleaning/Rebuilding Project: TestProject
Waiting for: Cleaning/Rebuilding Project: TestProject
Waiting for: Java indexing... 22 files to index (/TestProject)
Waiting for: Cleaning/Rebuilding Project: TestProject
Waiting for: Cleaning/Rebuilding Project: TestProject
Waiting for: Java indexing... 22 files to index (/TestProject)
Waiting for: Cleaning/Rebuilding Project: TestProject
Waiting for: Java indexing... 22 files to index (/TestProject)
Waiting for: Cleaning/Rebuilding Project: TestProject
Waiting for: Java indexing... 22 files to index (/TestProject)
Waiting for: Cleaning/Rebuilding Project: TestProject
Waiting for: Cleaning/Rebuilding Project: TestProject
Waiting for: Java indexing... 22 files to index (/TestProject)
Waiting for: Cleaning/Rebuilding Project: TestProject
Waiting for: Java indexing... 22 files to index (/TestProject)
Jul 29, 2021 12:02:45 AM groovy.util.FactoryBuilderSupport createNode
WARNING: Could not find match for name 'normal'
Jul 29, 2021 12:02:45 AM groovy.util.FactoryBuilderSupport createNode
WARNING: Could not find match for name 'normal'
Jul 29, 2021 12:03:12 AM groovy.util.FactoryBuilderSupport createNode
WARNING: Could not find match for name 'star'
Jul 29, 2021 12:03:12 AM groovy.util.FactoryBuilderSupport createNode
WARNING: Could not find match for name 'star'
Jul 29, 2021 12:03:13 AM groovy.util.FactoryBuilderSupport createNode
WARNING: Could not find match for name 'normal'
Jul 29, 2021 12:03:13 AM groovy.util.FactoryBuilderSupport createNode
WARNING: Could not find match for name 'normal'
Jul 29, 2021 12:03:15 AM groovy.util.FactoryBuilderSupport createNode
WARNING: Could not find match for name 'normal'
Jul 29, 2021 12:03:15 AM groovy.util.FactoryBuilderSupport createNode
WARNING: Could not find match for name 'normal'
Jul 29, 2021 12:03:15 AM groovy.util.FactoryBuilderSupport createNode
WARNING: Could not find match for name 'normal'
Jul 29, 2021 12:03:15 AM groovy.util.FactoryBuilderSupport createNode
WARNING: Could not find match for name 'normal'
Jul 29, 2021 12:03:20 AM groovy.util.FactoryBuilderSupport createNode
WARNING: Could not find match for name 'star'
Jul 29, 2021 12:03:28 AM groovy.util.FactoryBuilderSupport createNode
WARNING: Could not find match for name 'normal'
Jul 29, 2021 12:03:29 AM groovy.util.FactoryBuilderSupport createNode
WARNING: Could not find match for name 'star'
Jul 29, 2021 12:03:29 AM groovy.util.FactoryBuilderSupport createNode
WARNING: Could not find match for name 'normal'
Jul 29, 2021 12:03:29 AM groovy.util.FactoryBuilderSupport createNode
WARNING: Could not find match for name 'normal'
Jul 29, 2021 12:03:31 AM groovy.util.FactoryBuilderSupport createNode
WARNING: Could not find match for name 'star'
Jul 29, 2021 12:03:33 AM groovy.util.FactoryBuilderSupport createNode
WARNING: Could not find match for name 'normal'
Jul 29, 2021 12:03:34 AM groovy.util.FactoryBuilderSupport createNode
WARNING: Could not find match for name 'normal'
Jul 29, 2021 12:03:34 AM groovy.util.FactoryBuilderSupport createNode
WARNING: Could not find match for name 'normal'
Jul 29, 2021 12:07:26 AM groovy.util.FactoryBuilderSupport createNode
WARNING: Could not find match for name 'normal'
Executing Spock 2.0.0-groovy-3.0 with NOT compatible Groovy version 4.0.0-alpha-3 due to set spock.iKnowWhatImDoing.disableGroovyVersionCheck system property. This is unsupported and may result in weird runtime errors!
Executing Spock 2.0.0-groovy-3.0 with NOT compatible Groovy version 4.0.0-alpha-3 due to set spock.iKnowWhatImDoing.disableGroovyVersionCheck system property. This is unsupported and may result in weird runtime errors!
Executing Spock 2.0.0-groovy-3.0 with NOT compatible Groovy version 4.0.0-alpha-3 due to set spock.iKnowWhatImDoing.disableGroovyVersionCheck system property. This is unsupported and may result in weird runtime errors!
Executing Spock 2.0.0-groovy-3.0 with NOT compatible Groovy version 4.0.0-alpha-3 due to set spock.iKnowWhatImDoing.disableGroovyVersionCheck system property. This is unsupported and may result in weird runtime errors!
Executing Spock 2.0.0-groovy-3.0 with NOT compatible Groovy version 4.0.0-alpha-3 due to set spock.iKnowWhatImDoing.disableGroovyVersionCheck system property. This is unsupported and may result in weird runtime errors!
Executing Spock 2.0.0-groovy-3.0 with NOT compatible Groovy version 4.0.0-alpha-3 due to set spock.iKnowWhatImDoing.disableGroovyVersionCheck system property. This is unsupported and may result in weird runtime errors!
Executing Spock 2.0.0-groovy-3.0 with NOT compatible Groovy version 4.0.0-alpha-3 due to set spock.iKnowWhatImDoing.disableGroovyVersionCheck system property. This is unsupported and may result in weird runtime errors!
Jul 29, 2021 12:15:03 AM groovy.util.FactoryBuilderSupport createNode
WARNING: Could not find match for name 'normal'
Jul 29, 2021 12:15:03 AM groovy.util.FactoryBuilderSupport createNode
WARNING: Could not find match for name 'staticMember'
Jul 29, 2021 12:15:03 AM groovy.util.FactoryBuilderSupport createNode
WARNING: Could not find match for name 'staticMember'
TypeInferencingVisitorWithRequestor.findMethodNode: no match found for Search(Qgroovy.lang.Binding;)
TypeInferencingVisitorWithRequestor.findMethodNode: no match found for Search(Qgroovy.lang.Binding;)
TypeInferencingVisitorWithRequestor.findMethodNode: no match found for Search(Qgroovy.lang.Binding;)
TypeInferencingVisitorWithRequestor.findMethodNode: no match found for Search(Qgroovy.lang.Binding;)
TypeInferencingVisitorWithRequestor.findMethodNode: no match found for Search(Qgroovy.lang.Binding;)
TypeInferencingVisitorWithRequestor.findMethodNode: no match found for Search(Qgroovy.lang.Binding;)
TypeInferencingVisitorWithRequestor.findMethodNode: no match found for Search.test(QSet<Qjava.beans.BeanInfo;>;)
TypeInferencingVisitorWithRequestor.findMethodNode: no match found for Search.test(QSet<Qjava.beans.BeanInfo;>;)