Build: #582 failed

Job: Default Job failed

Stages & jobs

  1. Default Stage

Test results

  • 6,181 tests in total
  • 4 tests failed
  • 4 failures are new
  • 101 tests were quarantined / skipped
  • 89 minutes taken in total.

Build 582 has the following 4 errors: 4 new failure(s) occurred since the previous build.

New test failures 4
Status Test Duration
Collapse Failed BasicGroovyBuildTests testBuildJavaHelloWorld History
< 1 sec
java.lang.AssertionError: array lengths differed, expected.length=1 actual.length=2
	at org.eclipse.jdt.core.groovy.tests.builder.BasicGroovyBuildTests.testBuildJavaHelloWorld(BasicGroovyBuildTests.java:204)
Collapse Failed BasicGroovyBuildTests testNoDoubleResolve History
< 1 sec
java.lang.AssertionError
	at org.eclipse.jdt.core.groovy.tests.builder.BasicGroovyBuildTests.testNoDoubleResolve(BasicGroovyBuildTests.java:2810)
Collapse Failed BasicGroovyBuildTests testProjectCompilerConfigScript2 History
< 1 sec
java.lang.AssertionError: array lengths differed, expected.length=1 actual.length=2
	at org.eclipse.jdt.core.groovy.tests.builder.BasicGroovyBuildTests.testProjectCompilerConfigScript2(BasicGroovyBuildTests.java:372)
Collapse Failed BasicGroovyBuildTests testSlow_GRE870 History
< 1 sec
java.lang.AssertionError: array lengths differed, expected.length=2 actual.length=4
	at org.eclipse.jdt.core.groovy.tests.builder.BasicGroovyBuildTests.testSlow_GRE870(BasicGroovyBuildTests.java:1567)