Build: #95 failed

Job: Default Job failed

Stages & jobs

  1. Default Stage

Job result summary

Completed
Duration
88 minutes
Agent
bamboo-15.af.pivotal.io
Revision
94e1d915eacbeb364b22c0bdc277fc070aa0fd81 94e1d915eacbeb364b22c0bdc277fc070aa0fd81
Total tests
6108
Failing since
#94 (Code changes detected – )
Fixed in
#99 (Code changes detected)

Tests

  • 6,108 tests in total
  • 9 tests failed
  • 8 failures are new
  • 4 tests were fixed
  • 125 tests were quarantined / skipped
  • 84 minutes taken in total.
New test failures 8
Status Test Duration
Collapse Failed BasicGroovyBuildTests testIncrementalCompilationTheBasics2_changingJavaDependedUponByGroovy History
< 1 sec
org.junit.ComparisonFailure: unexpected recompiled units. lenExpected=2 lenActual=4 expected:<{pkg.GHello,pkg.[]Hello}> but was:<{pkg.GHello,pkg.[GHello,pkg.Hello,pkg.]Hello}>
	at org.eclipse.jdt.core.groovy.tests.builder.BasicGroovyBuildTests.testIncrementalCompilationTheBasics2_changingJavaDependedUponByGroovy(BasicGroovyBuildTests.java:2236)
Collapse Failed BinarySearchTests testClassDecl2 History
1 sec
java.lang.AssertionError: Expecting 4 matches, but found 0

java.lang.AssertionError: 
Expecting 4 matches, but found 0

	at org.eclipse.jdt.core.groovy.tests.search.BinarySearchTests.assertMatches(BinarySearchTests.java:139)
	at org.eclipse.jdt.core.groovy.tests.search.BinarySearchTests.testClassDecl2(BinarySearchTests.java:172)
Collapse Failed ClosureInferencingTests testNestedClosure11 History
< 1 sec
java.lang.AssertionError: Expected type not found.
Expected: java.lang.Integer
Found: Search
Declaring type: groovy.lang.Closure<V extends java.lang.Object>
ASTNode: org.codehaus.groovy.ast.expr.ConstantExpression@f9e59[delegate]
Confidence: INFERRED

java.lang.AssertionError: 
(8 more lines...)
Collapse Failed ConstructorReferenceSearchTests testConstructorReferences1 History
< 1 sec
java.lang.AssertionError: Incorrect number of matches; expected:<3> but was:<0>
	at org.eclipse.jdt.core.groovy.tests.search.ConstructorReferenceSearchTests.testConstructorReferences1(ConstructorReferenceSearchTests.java:59)
Collapse Failed StaticCompilationTests testCompileStatic7996[Java 1.7] History
< 1 sec
junit.framework.ComparisonFailure: Unexpected error running resulting class file for Main.groovy:
--[START]--
java.lang.ClassCastException: java.lang.String cannot be cast to java.util.List
 at Bar$_doStuff_closure1.doCall(Bar.groovy:6)
 at Bar$_doStuff_closure1.call(Bar.groovy)
 at org.codehaus.groovy.runtime.DefaultGroovyMethods.with(DefaultGroovyMethods.java:351)
 at org.codehaus.groovy.runtime.DefaultGroovyMethods.with(DefaultGroovyMethods.java:298)
 at org.codehaus.groovy.runtime.dgm$852.invoke(Unknown Source)
(242 more lines...)
Collapse Failed StaticCompilationTests testCompileStatic7996[Java 1.8] History
< 1 sec
junit.framework.ComparisonFailure: Unexpected error running resulting class file for Main.groovy:
--[START]--
java.lang.ClassCastException: java.lang.String cannot be cast to java.util.List
 at Bar$_doStuff_closure1.doCall(Bar.groovy:6)
 at Bar$_doStuff_closure1.call(Bar.groovy)
 at org.codehaus.groovy.runtime.DefaultGroovyMethods.with(DefaultGroovyMethods.java:351)
 at org.codehaus.groovy.runtime.DefaultGroovyMethods.with(DefaultGroovyMethods.java:298)
 at org.codehaus.groovy.runtime.dgm$852.invoke(Unknown Source)
(242 more lines...)
Collapse Failed StaticCompilationTests testCompileStatic7996a[Java 1.7] History
< 1 sec
junit.framework.ComparisonFailure: Unexpected error running resulting class file for Main.groovy:
--[START]--
java.lang.ClassCastException: java.lang.String cannot be cast to java.util.List
 at Bar$_doStuff_closure1.doCall(Bar.groovy:6)
 at Bar$_doStuff_closure1.call(Bar.groovy)
 at org.codehaus.groovy.runtime.DefaultGroovyMethods.with(DefaultGroovyMethods.java:351)
 at org.codehaus.groovy.runtime.DefaultGroovyMethods.with(DefaultGroovyMethods.java:298)
 at org.codehaus.groovy.runtime.dgm$852.invoke(Unknown Source)
(242 more lines...)
Collapse Failed StaticCompilationTests testCompileStatic7996a[Java 1.8] History
< 1 sec
junit.framework.ComparisonFailure: Unexpected error running resulting class file for Main.groovy:
--[START]--
java.lang.ClassCastException: java.lang.String cannot be cast to java.util.List
 at Bar$_doStuff_closure1.doCall(Bar.groovy:6)
 at Bar$_doStuff_closure1.call(Bar.groovy)
 at org.codehaus.groovy.runtime.DefaultGroovyMethods.with(DefaultGroovyMethods.java:351)
 at org.codehaus.groovy.runtime.DefaultGroovyMethods.with(DefaultGroovyMethods.java:298)
 at org.codehaus.groovy.runtime.dgm$852.invoke(Unknown Source)
(242 more lines...)
Existing test failures 1
Status Test Failing since Duration
java.lang.AssertionError: expected:<2> but was:<0>
	at org.eclipse.jdt.core.groovy.tests.search.ConstructorReferenceSearchTests.testConstructorReferences12(ConstructorReferenceSearchTests.java:313)
Fixed tests 4
Status Test Failing since Duration
Successful GroovyContentTypeTests testGroovyThenJavaProject History
Failing since build #94 (Code changes detected) < 1 sec
Successful ConstructorReferenceSearchTests testConstructorReferences10 History
Failing since build #94 (Code changes detected) < 1 sec
Successful ConstructorReferenceSearchTests testConstructorReferences13 History
Failing since build #94 (Code changes detected) < 1 sec
Successful ConstructorReferenceSearchTests testNewifyConstructorReferences3 History
Failing since build #94 (Code changes detected) < 1 sec

Error summary

The build generated some errors. See the full build log for more details.

Oct 28, 2019 2:56:21 PM org.apache.http.impl.execchain.RetryExec execute
INFO: I/O exception (org.apache.http.NoHttpResponseException) caught when processing request to {s}->https://download.eclipse.org:443: The target server failed to respond
Oct 28, 2019 2:56:21 PM org.apache.http.impl.execchain.RetryExec execute
INFO: Retrying request to {s}->https://download.eclipse.org:443
SWT SessionManagerDBus: Failed to connect to org.gnome.SessionManager: Failed to execute child process “dbus-launch” (No such file or directory)
SWT SessionManagerDBus: Failed to connect to org.xfce.SessionManager: Failed to execute child process “dbus-launch” (No such file or directory)
TypeInferencingVisitorWithRequestor.findMethodNode: no match found for Main.main([Qjava.lang.String;)
TypeInferencingVisitorWithRequestor.findMethodNode: no match found for Main.main([Qjava.lang.String;)
CodeSelectRequestor: Could not proceed due to null declaring type for org.codehaus.groovy.ast.expr.BinaryExpression@ecbea[org.codehaus.groovy.ast.expr.VariableExpression@ecbe3[variable: it]("in" at 1:20:  "in" )org.codehaus.groovy.ast.expr.ListExpression@ee270[]]
CodeSelectRequestor: Could not proceed due to null declaring type for org.codehaus.groovy.ast.expr.RangeExpression@ebcdd
CodeSelectRequestor: Could not proceed due to null declaring type for org.codehaus.groovy.ast.expr.RangeExpression@ebcde
TypeInferencingVisitorWithRequestor.findMethodNode: no match found for Type.x(QList<Qjava.util.Date;>;)
TypeInferencingVisitorWithRequestor.findMethodNode: no match found for Type.x(QList<Qjava.lang.Number;>;)
TypeInferencingVisitorWithRequestor.findMethodNode: no match found for Type.x(QList<Qjava.lang.Number;>;)
TypeInferencingVisitorWithRequestor.findMethodNode: no match found for Type.x(QList<Qjava.util.Date;>;)
TypeInferencingVisitorWithRequestor.findMethodNode: no match found for Type.x(QList<Qjava.lang.Number;>;)
TypeInferencingVisitorWithRequestor.findMethodNode: no match found for Type.x(QList<Qjava.lang.Number;>;)
CodeSelectRequestor: Could not proceed due to null declaring type for org.codehaus.groovy.ast.expr.ConstantExpression@e8fc6[fff]
CodeSelectRequestor: Could not proceed due to null declaring type for org.codehaus.groovy.ast.expr.ConstantExpression@e8fca[fff]
CodeSelectRequestor: Could not proceed due to null declaring type for org.codehaus.groovy.ast.expr.ConstantExpression@e8fca[fff]
Waiting for: Java indexing... 4 files to index (/Project)
Waiting for: Java indexing... 22 files to index (/Project)
Waiting for: Java indexing... 4 files to index (/opt/bamboo-home/xml-data/build-dir/GRECLIPSE-E413-JOB1/ide-test/org.codehaus.groovy.alltests/target/work/plugins/org.eclipse.jdt.groovy.core.tests.builder_3.6.0.v201910281456-e1909/lib/binGroovySearch.jar)
Waiting for: Java indexing... 22 files to index (/Project)
Waiting for: Java indexing... 22 files to index (/Project)
Waiting for: Java indexing... 22 files to index (/Project)
Waiting for: Java indexing... 22 files to index (/Project)
Waiting for: Java indexing... 21 files to index (/Project)
Waiting for: Java indexing... 21 files to index (/Project)
Waiting for: Java indexing... 21 files to index (/opt/jdk8u212-b03/jre/lib/resources.jar)
Waiting for: Java indexing... 7 files to index (/Project)