Build: #119 failed Changes by Eric Milles

Build result summary

Details

Completed
Duration
91 minutes
Labels
None
Agent
bamboo-17.af.pivotal.io
Revision
95cc588cee7b8540ca9207fe4092645a289fbfca 95cc588cee7b8540ca9207fe4092645a289fbfca
Total tests
6150

Tests

Responsible

Code commits

Author Commit Message Commit date
Eric Milles Eric Milles 95cc588cee7b8540ca9207fe4092645a289fbfca 95cc588cee7b8540ca9207fe4092645a289fbfca fix style issues
Eric Milles Eric Milles 778e9cfbc37ee45a64f518d4d87ce7cf2442d4c1 778e9cfbc37ee45a64f518d4d87ce7cf2442d4c1 fix for Checkstyle 8.24+

Tests

New test failures 6
Status Test View job Duration
Collapse Failed GroovyContentTypeTests testJavaThenGroovyProject History
Default Job < 1 sec
java.lang.AssertionError: L/Project/bin/p1/HelloJava.class should exist
	at org.eclipse.jdt.core.groovy.tests.model.GroovyContentTypeTests.checkJavaProject(GroovyContentTypeTests.java:152)
	at org.eclipse.jdt.core.groovy.tests.model.GroovyContentTypeTests.testJavaThenGroovyProject(GroovyContentTypeTests.java:98)
Collapse Failed ArrayInferencingTests testArrayProperty9 History
Default Job < 1 sec
java.lang.AssertionError: Expected type not found.
Expected: XX[]
Found: java.lang.String
Declaring type: java.lang.String
ASTNode: org.codehaus.groovy.ast.expr.ConstantExpression@fd2ef[xx]
Confidence: UNKNOWN

java.lang.AssertionError: 
(8 more lines...)
Collapse Failed BinarySearchTests testClassDecl1 History
Default Job 1 sec
java.lang.AssertionError: Expecting 12 matches, but found 0

java.lang.AssertionError: 
Expecting 12 matches, but found 0

	at org.eclipse.jdt.core.groovy.tests.search.BinarySearchTests.assertMatches(BinarySearchTests.java:139)
	at org.eclipse.jdt.core.groovy.tests.search.BinarySearchTests.testClassDecl1(BinarySearchTests.java:165)
Collapse Failed DGMInferencingTests testDGMClosure10 History
Default Job < 1 sec
java.lang.AssertionError: Expected type not found.
Expected: java.util.Date
Found: java.lang.Object
Declaring type: Search
ASTNode: org.codehaus.groovy.ast.expr.VariableExpression@f2252[variable: val]
Confidence: INFERRED

java.lang.AssertionError: 
(9 more lines...)
Collapse Failed MethodReferenceSearchTests testMethodWithDefaultParameters3 History
Default Job < 1 sec
java.lang.AssertionError: expected:<2> but was:<0>
	at org.eclipse.jdt.core.groovy.tests.search.MethodReferenceSearchTests.testMethodWithDefaultParameters3(MethodReferenceSearchTests.java:389)
Collapse Failed TypeReferenceSearchTests testFindClassDeclarationWithPattern History
Default Job < 1 sec
java.lang.AssertionError: Number of results found expected:<2> but was:<0>
	at org.eclipse.jdt.core.groovy.tests.search.TypeReferenceSearchTests.testFindClassDeclarationWithPattern(TypeReferenceSearchTests.java:220)