Build: #155 failed Changes by Eric Milles

Build result summary

Details

Completed
Duration
96 minutes
Labels
None
Agent
bamboo-12.af.pivotal.io
Revision
6effbf75085f86e2fd9efa01a3519bea51c41195 6effbf75085f86e2fd9efa01a3519bea51c41195
Total tests
6310
Failing since
#150 (Changes by Eric Milles)
Fixed in
#157 (Changes by Eric Milles)

Responsible

Code commits

Author Commit Message Commit date
Eric Milles Eric Milles 6effbf75085f86e2fd9efa01a3519bea51c41195 6effbf75085f86e2fd9efa01a3519bea51c41195 minor fix-ups

Tests

New test failures 8
Status Test View job Duration
Collapse Failed JUnit3TestFinderTests testFindAllTestSuites History
Default Job 1 sec
org.eclipse.jdt.core.JavaModelException: /TestProject/src/p/script.groovy already exists in target
	at org.codehaus.groovy.eclipse.junit.test.JUnit3TestFinderTests.testFindAllTestSuites(JUnit3TestFinderTests.groovy:82)
Collapse Failed JUnit3TestFinderTests testFinderOfSubclass History
Default Job 2 secs
org.eclipse.jdt.core.JavaModelException: /TestProject/src/p/script.groovy already exists in target
	at org.codehaus.groovy.eclipse.junit.test.JUnit3TestFinderTests.testFinderOfSubclass(JUnit3TestFinderTests.groovy:50)
Collapse Failed JUnit3TestFinderTests testFinderOfNonPublicSubclass History
Default Job 4 secs
org.eclipse.jdt.core.JavaModelException: /TestProject/src/p/script.groovy already exists in target
	at org.codehaus.groovy.eclipse.junit.test.JUnit3TestFinderTests.testFinderOfNonPublicSubclass(JUnit3TestFinderTests.groovy:66)
Collapse Failed JUnit4TestFinderTests testFinderOfNonPublicSubclass History
Default Job 4 secs
org.eclipse.jdt.core.JavaModelException: /TestProject/src/p/script.groovy already exists in target
	at org.codehaus.groovy.eclipse.junit.test.JUnit4TestFinderTests.testFinderOfNonPublicSubclass(JUnit4TestFinderTests.groovy:67)
Collapse Failed JUnit4TestFinderTests testFindAllTestSuites History
Default Job 1 sec
org.eclipse.jdt.core.JavaModelException: /TestProject/src/p/script.groovy already exists in target
	at org.codehaus.groovy.eclipse.junit.test.JUnit4TestFinderTests.testFindAllTestSuites(JUnit4TestFinderTests.groovy:123)
Collapse Failed JUnit4TestFinderTests testFinderOfSubclass History
Default Job 1 sec
org.eclipse.jdt.core.JavaModelException: /TestProject/src/p/script.groovy already exists in target
	at org.codehaus.groovy.eclipse.junit.test.JUnit4TestFinderTests.testFinderOfSubclass(JUnit4TestFinderTests.groovy:51)
Collapse Failed BasicGroovyBuildTests testBuildGroovyHelloWorld2 History
Default Job < 1 sec
org.junit.ComparisonFailure: unexpected recompiled units. lenExpected=1 lenActual=2 expected:<{p1.Hello[]}> but was:<{p1.Hello[,p1.Hello]}>
	at org.eclipse.jdt.core.groovy.tests.builder.BasicGroovyBuildTests.testBuildGroovyHelloWorld2(BasicGroovyBuildTests.java:215)
Collapse Failed BuildAccessRulesTests testAccessForImport History
Default Job < 1 sec
junit.framework.ComparisonFailure: 
----------- Expected ------------
Problem : Access restriction: The type 'BeanDescriptor' is not API (restriction on required library '##') [ resource : </Project/src/Foo.groovy> range : <7,32> category : <150> severity : <2>]

------------ but was ------------

--------- Difference is ----------
 expected:<[Problem : Access restriction: The type 'BeanDescriptor' is not API (restriction on required library '##') [ resource : </Project/src/Foo.groovy> range : <7,32> category : <150> severity : <2>]
(13 more lines...)
Fixed tests 1
Status Test Failing since View job Duration
Successful BasicGroovyBuildTests testProjectBasedirAsOutputLocation History
Failing since build #154 (Changes by Eric Milles) Default Job < 1 sec