Build: #47 failed Changes by Eric Milles

Build result summary

Details

Completed
Duration
92 minutes
Labels
None
Agent
bamboo-20.af.pivotal.io
Revision
f40793f60ca401f0751b6f298cca3f16e09d6d96 f40793f60ca401f0751b6f298cca3f16e09d6d96
Total tests
6156
Failing since
#45 (Changes by Eric Milles)
Fixed in
#48 (Changes by Eric Milles)

Responsible

Code commits

Author Commit Message Commit date
Eric Milles Eric Milles f40793f60ca401f0751b6f298cca3f16e09d6d96 f40793f60ca401f0751b6f298cca3f16e09d6d96 GROOVY-8686

Tests

New test failures 4
Status Test View job Duration
Collapse Failed BasicGroovyBuildTests testBuildGroovyHelloWorld History
Default Job < 1 sec
org.junit.ComparisonFailure: unexpected recompiled units. lenExpected=1 lenActual=2 expected:<{p1.Hello[]}> but was:<{p1.Hello[,p1.Hello]}>
	at org.eclipse.jdt.core.groovy.tests.builder.BasicGroovyBuildTests.testBuildGroovyHelloWorld(BasicGroovyBuildTests.java:195)
Collapse Failed BasicGroovyBuildTests testTaskMarkerSharedDescription History
Default Job < 1 sec
org.eclipse.core.internal.resources.ResourceException: Marker id 249 not found.
	at org.eclipse.jdt.core.groovy.tests.builder.BasicGroovyBuildTests.testTaskMarkerSharedDescription(BasicGroovyBuildTests.java:2618)
Collapse Failed GroovyContentTypeTests testGroovyThenJavaProject History
Default Job < 1 sec
java.lang.AssertionError: L/Project/bin/p1/HelloJava.class should exist
	at org.eclipse.jdt.core.groovy.tests.model.GroovyContentTypeTests.checkJavaProject(GroovyContentTypeTests.java:152)
	at org.eclipse.jdt.core.groovy.tests.model.GroovyContentTypeTests.testGroovyThenJavaProject(GroovyContentTypeTests.java:90)
Collapse Failed DGMInferencingTests testDGM37 History
Default Job < 1 sec
java.lang.AssertionError: Expected type not found.
Expected: java.io.DataInputStream
Found: java.lang.Object
Declaring type: groovy.lang.Closure<V extends java.lang.Object>
ASTNode: org.codehaus.groovy.ast.expr.VariableExpression@f2251[variable: it]
Confidence: INFERRED

java.lang.AssertionError: 
(9 more lines...)
Fixed tests 1
Status Test Failing since View job Duration
Successful BuildAccessRulesTests testAccessForLocalVariable History
Failing since build #46 (Changes by Eric Milles) Default Job < 1 sec

Jira issues

IssueDescriptionStatus
Unknown Issue TypeGROOVY-8686Could not obtain issue details from Jira