Build: #61 failed Changes by Eric Milles

Build result summary

Details

Completed
Duration
95 minutes
Labels
None
Agent
bamboo-19.af.pivotal.io
Revision
1780c16c2593ecdbf3d2cbcce3335e9b6f0a29e2 1780c16c2593ecdbf3d2cbcce3335e9b6f0a29e2
Total tests
6184

Tests

Responsible

Code commits

Author Commit Message Commit date
Eric Milles Eric Milles 1780c16c2593ecdbf3d2cbcce3335e9b6f0a29e2 1780c16c2593ecdbf3d2cbcce3335e9b6f0a29e2 Fix for #959: check aliased annotations for attribute methods

Tests

New test failures 5
Status Test View job Duration
Collapse Failed BasicGroovyBuildTests testClosureIncremental History
Default Job < 1 sec
org.junit.ComparisonFailure: unexpected recompiled units. lenExpected=5 lenActual=10 expected:<{Launch,[OtherGroovy,OtherGroovy$_iterate_closure1,Runner],Runner$_run_closure...> but was:<{Launch,[Launch,OtherGroovy,OtherGroovy,OtherGroovy$_iterate_closure1,OtherGroovy$_iterate_closure1,Runner,Runner,Runner$_run_closure1],Runner$_run_closure...>
	at org.eclipse.jdt.core.groovy.tests.builder.BasicGroovyBuildTests.testClosureIncremental(BasicGroovyBuildTests.java:1751)
Collapse Failed ConstructorReferenceSearchTests testNewifyConstructorReferences4 History
Default Job < 1 sec
java.lang.AssertionError: expected:<2> but was:<0>
	at org.eclipse.jdt.core.groovy.tests.search.ConstructorReferenceSearchTests.testNewifyConstructorReferences4(ConstructorReferenceSearchTests.java:450)
Collapse Failed ConstructorReferenceSearchTests testNewifyConstructorReferences1 History
Default Job < 1 sec
java.lang.AssertionError: expected:<2> but was:<0>
	at org.eclipse.jdt.core.groovy.tests.search.ConstructorReferenceSearchTests.testNewifyConstructorReferences1(ConstructorReferenceSearchTests.java:387)
Collapse Failed DGMInferencingTests testDGM26a History
Default Job < 1 sec
java.lang.AssertionError: Expected type not found.
Expected: java.lang.String
Found: java.lang.Object
Declaring type: Search
ASTNode: org.codehaus.groovy.ast.expr.VariableExpression@f2d98[variable: key]
Confidence: INFERRED

java.lang.AssertionError: 
(9 more lines...)
Collapse Failed TypeReferenceSearchTests testFindClassDeclarationWithPattern History
Default Job 1 sec
java.lang.AssertionError: Number of results found expected:<2> but was:<0>
	at org.eclipse.jdt.core.groovy.tests.search.TypeReferenceSearchTests.testFindClassDeclarationWithPattern(TypeReferenceSearchTests.java:220)