Build: #201 failed Changes by Eric Milles

Build result summary

Details

Completed
Duration
101 minutes
Labels
None
Agent
bamboo-16.af.pivotal.io
Revision
0614e62998fdb6c9009bdcf63983100459fceabc 0614e62998fdb6c9009bdcf63983100459fceabc
Total tests
6567
Fixed in
#202 (Custom build by Eric Milles with revision v3.8.0)

Tests

Responsible

Code commits

Author Commit Message Commit date
Eric Milles Eric Milles 0614e62998fdb6c9009bdcf63983100459fceabc 0614e62998fdb6c9009bdcf63983100459fceabc Fix for #1127: no DSLD contribution for types defined within a script

Tests

New test failures 2
Status Test View job Duration
Collapse Failed BasicGroovyBuildTests testUpdateProjectPreferences History
Default Job < 1 sec
java.lang.AssertionError: missing expected problem: Problem : The import util.MyException is never used [ resource : </Project/src/p/Test.java> range : <18,34> category : <120> severity : <1>]
	at org.eclipse.jdt.core.groovy.tests.builder.BasicGroovyBuildTests.testUpdateProjectPreferences(BasicGroovyBuildTests.java:3433)
Collapse Failed InferencingTests testNothingIsUnknownWithCategories History
Default Job < 1 sec
java.lang.AssertionError: Should not have found any AST nodes with unknown confidence, but found:
[org.codehaus.groovy.ast.expr.ConstantExpression@f87c8[use], org.codehaus.groovy.ast.expr.ConstantExpression@1003ce[println], org.codehaus.groovy.ast.expr.ConstantExpression@10784c[println], org.codehaus.groovy.ast.expr.ConstantExpression@156326[use]]
java.lang.AssertionError: 
Should not have found any AST nodes with unknown confidence, but found:
[org.codehaus.groovy.ast.expr.ConstantExpression@f87c8[use], org.codehaus.groovy.ast.expr.ConstantExpression@1003ce[println], org.codehaus.groovy.ast.expr.ConstantExpression@10784c[println], org.codehaus.groovy.ast.expr.ConstantExpression@156326[use]]
	at org.eclipse.jdt.core.groovy.tests.search.InferencingTests.assertNoUnknowns(InferencingTests.java:44)
	at org.eclipse.jdt.core.groovy.tests.search.InferencingTests.testNothingIsUnknownWithCategories(InferencingTests.java:2824)