Build: #239 failed Changes by Eric Milles

Build result summary

Details

Completed
Duration
100 minutes
Labels
None
Agent
bamboo-22.af.pivotal.io
Revision
55669ca62545fad4437cdf10f7dbdf8b61aaeff9 55669ca62545fad4437cdf10f7dbdf8b61aaeff9
Total tests
6647
Failing since
#238 (Changes by Eric Milles)
Fixed in
#241 (Changes by Eric Milles)

Responsible

Code commits

Author Commit Message Commit date
Eric Milles Eric Milles 55669ca62545fad4437cdf10f7dbdf8b61aaeff9 55669ca62545fad4437cdf10f7dbdf8b61aaeff9 GROOVY-9386

Tests

New test failures 2
Status Test View job Duration
Collapse Failed DGMInferencingTests testDGM50 History
Default Job < 1 sec
java.lang.AssertionError: Expected type not found.
Expected: java.lang.Long
Found: java.lang.Object
Declaring type: java.lang.Long
ASTNode: org.codehaus.groovy.ast.expr.ConstantExpression@309873cf[abs]
Confidence: UNKNOWN

java.lang.AssertionError: 
(9 more lines...)
Collapse Failed MethodReferenceSearchTests testGenericsMethodReferenceSearch History
Default Job 1 sec
java.lang.AssertionError: expected:<1> but was:<0>
	at org.eclipse.jdt.core.groovy.tests.search.MethodReferenceSearchTests.testGenericsMethodReferenceSearch(MethodReferenceSearchTests.java:860)
Fixed tests 2
Status Test Failing since View job Duration
Successful BasicGroovyBuildTests testTaskMarkerSharedDescription History
Failing since build #238 (Changes by Eric Milles) Default Job < 1 sec
Successful BasicGroovyBuildTests testTraitBasics History
Failing since build #238 (Changes by Eric Milles) Default Job < 1 sec

Jira issues

IssueDescriptionStatus
Unknown Issue TypeGROOVY-9386Could not obtain issue details from Jira