Build: #291 failed Changes by Eric Milles

Build result summary

Details

Completed
Duration
102 minutes
Labels
None
Agent
bamboo-24.af.pivotal.io
Revision
25de4ee90e719a7dff6d30369d028ae54b91c6e8 25de4ee90e719a7dff6d30369d028ae54b91c6e8
Total tests
6807
Failing since
#290 (Changes by Eric Milles)
Fixed in
#294 (Changes by Eric Milles)

Responsible

Code commits

Author Commit Message Commit date
Eric Milles Eric Milles 25de4ee90e719a7dff6d30369d028ae54b91c6e8 25de4ee90e719a7dff6d30369d028ae54b91c6e8 Eclipse 4.17 JDT Patch for Groovy-Eclipse: JDT commit 8d0952b
#1139
Eric Milles Eric Milles 16aeea7156ce400c6ded228bcd637779f0c1d790 16aeea7156ce400c6ded228bcd637779f0c1d790 Fix for #1160: Object and Object[] get same distance in fallback

Tests

New test failures 5
Status Test View job Duration
Collapse Failed ClosureInferencingTests testNestedClosure3 History
Default Job < 1 sec
java.lang.AssertionError: Expected type not found.
Expected: java.lang.Integer
Found: java.lang.Object
Declaring type: groovy.lang.Closure
ASTNode: org.codehaus.groovy.ast.expr.ConstantExpression@487f00cc[intValue]
Confidence: UNKNOWN

java.lang.AssertionError: 
(8 more lines...)
Collapse Failed ClosureInferencingTests testClosure25 History
Default Job < 1 sec
java.lang.AssertionError: Expected type not found.
Expected: java.lang.Void
Found: java.lang.Long
Declaring type: Search
ASTNode: org.codehaus.groovy.ast.expr.VariableExpression@87a4a8b[variable: time]
Confidence: INFERRED

java.lang.AssertionError: 
(8 more lines...)
Collapse Failed DGMInferencingTests testDGMClosure13 History
Default Job < 1 sec
java.lang.AssertionError: Expected type not found.
Expected: java.lang.Integer
Found: java.lang.Object
Declaring type: Search
ASTNode: org.codehaus.groovy.ast.expr.VariableExpression@62ba3b32[variable: key]
Confidence: INFERRED

java.lang.AssertionError: 
(9 more lines...)
Collapse Failed DGMInferencingTests testDGMDeclaring2 History
Default Job < 1 sec
java.lang.AssertionError: Expected declaring type not found.
 Expected: org.codehaus.groovy.runtime.ResourceGroovyMethods
 Found type: java.lang.Object
 Found declaring type: java.io.File
 ASTNode: org.codehaus.groovy.ast.expr.ConstantExpression@6ae5a8fe[eachLine]
java.lang.AssertionError: 
Expected declaring type not found.
	Expected: org.codehaus.groovy.runtime.ResourceGroovyMethods
(5 more lines...)
Collapse Failed GenericInferencingTests testList10 History
Default Job < 1 sec
java.lang.AssertionError: Expected type not found.
Expected: java.util.List<java.lang.String>
Found: java.util.List<java.lang.Object>
Declaring type: Search
ASTNode: org.codehaus.groovy.ast.expr.VariableExpression@42419d9a[variable: xxx]
Confidence: INFERRED

java.lang.AssertionError: 
(8 more lines...)
Fixed tests 1
Status Test Failing since View job Duration
Successful BasicGroovyBuildTests testBuildJavaHelloWorld History
Failing since build #290 (Changes by Eric Milles) Default Job < 1 sec